program: Gaussian 09
title: 000113376
version: EM64L-G09RevD.01
frameworkgroup: C1[X(C13H18N5)]
method: RPBEPBE
basis: SDD
operation: Freq
keyword: #p
keyword: freq=noraman
keyword: PBEPBE/SDD
title: #p freq=noraman PBEPBE/SDD
converged: NO YES NO NO
title: Mulliken charges:
elementType: N N N N N C C C C C C C C C C C C C H H H H H H H H H H H H H H H H H H
charge: -0.149512 -0.125997 -0.132026 -0.105439 -0.094714 0.285909 -0.147419 -0.153141 0.421392 -0.615030 -0.572564 0.160967 -0.287507 -0.304882 -0.291381 -0.339275 -0.638864 -0.637512 0.291989 0.290414 0.282498 0.262318 0.262281 0.230284 0.272610 0.272883 0.258728 0.262064 0.269996 0.257088 0.257240 0.242279 0.257108 0.241717 0.257594 0.257904
chargesum: 1.00000
title: Mulliken charges with hydrogens summed into heavy atoms:
elementType: N N N N N C C C C C C C C C C C C C
charge: -0.149512 -0.125997 -0.132026 -0.105439 -0.094714 0.285909 0.144570 0.137273 0.421392 0.192068 0.203213 0.160967 -0.028779 -0.042818 -0.021386 -0.082187 0.117763 0.119703
polarizability: 5.33017172e+02 1.15810912e+00 1.71348892e+02 4.87428115e-02 1.12876037e-01 8.49492045e+01
1716.lowfreq: -7.0835 -0.0010 -0.0007 -0.0006 5.5247 5.9065 23.1831 40.0170 60.4648
frequency: 21.0666 40.0049 60.4648 61.4815 92.1604 94.4998 135.5704 145.1095 150.0711 161.0963 176.6566 202.0909 203.5821 261.6525 268.4949 293.4581 313.2305 332.4006 386.4026 394.3898 430.6884 444.1798 478.7239 527.7463 530.7655 547.8937 589.0680 605.1043 623.8088 693.8667 704.4572 740.3961 748.5634 752.0182 797.5957 803.3827 844.6645 845.1471 872.9161 929.5879 977.0795 977.8707 989.5640 1018.0428 1032.0934 1050.2845 1088.3424 1094.9629 1097.1307 1116.2206 1125.2272 1129.3557 1130.4708 1163.7160 1168.0972 1202.9325 1233.2205 1233.9819 1279.7024 1309.4756 1318.7916 1333.6337 1350.5451 1378.5165 1381.1941 1408.2491 1432.4301 1433.6746 1451.8848 1455.8429 1456.8140 1468.3185 1474.1577 1477.0533 1478.2438 1483.9530 1485.6983 1491.3812 1497.6731 1498.7058 1520.9815 1538.0060 1555.3292 1629.7409 2980.4062 2985.3259 3015.5561 3025.9220 3061.1111 3064.0307 3110.7941 3126.0236 3132.9339 3135.6421 3136.8986 3144.6105 3158.4060 3164.9682 3184.7302 3190.0010 3252.6069 3278.3020
redmass: 3.1522 4.4023 4.3224 1.9439 1.0882 3.3407 1.1662 2.4391 1.1817 4.5811 1.2807 3.9993 3.7797 3.6366 3.4586 3.8404 3.0459 6.0627 3.8127 4.6340 3.7809 3.6780 3.4621 2.3401 4.2331 4.3014 4.6389 3.3300 7.1305 4.0774 5.0778 1.4671 5.5035 3.9167 7.3904 1.2685 1.7634 1.3851 7.6240 3.0613 1.3423 2.9312 1.3315 2.6675 1.9548 1.6111 1.2334 2.1602 1.1577 1.3583 1.3203 1.4613 1.3177 1.7310 1.8338 1.7161 2.1157 1.8511 3.8908 1.6017 4.1691 4.1852 4.7332 3.8116 2.6665 1.7505 1.2054 1.7865 1.2709 1.0399 1.3992 1.0392 1.2580 1.2466 1.2203 1.0408 1.0446 1.7745 2.7983 1.4970 4.1088 3.0173 3.9181 6.3017 1.0362 1.0382 1.0340 1.0329 1.1007 1.1031 1.1036 1.0989 1.1026 1.1040 1.0967 1.1009 1.0896 1.0871 1.0961 1.0956 1.0934 1.1116
irintensity: 0.5151 3.7050 1.4297 0.0109 0.2478 0.2397 0.1078 5.5603 2.2141 1.9451 0.4704 1.3815 8.7804 0.6658 2.1466 3.9965 1.3392 0.0093 3.6798 1.7717 1.5545 0.0987 3.2382 20.8388 21.2161 1.3210 0.2534 0.0053 3.8694 25.4721 15.6348 55.5001 14.1223 7.2321 4.4778 1.3497 78.1911 1.3505 20.8435 26.0948 0.3730 1.2591 0.3116 1.3376 1.2216 20.9989 0.0033 35.2175 5.8200 0.6286 0.3898 4.4216 1.0052 3.0796 109.3844 161.7334 2.2370 50.2417 138.2569 109.9398 447.5654 73.8975 681.1186 138.3172 212.8258 13.5561 13.9035 26.5175 5.6260 20.3440 10.6084 0.0044 17.8969 15.1093 42.4977 19.9590 35.3658 43.1319 8.4946 33.2546 3.8901 115.1659 298.3703 483.0065 35.4011 90.8396 30.3107 13.7525 2.2272 32.4182 7.6125 1.7893 4.1781 17.0430 23.9171 0.5266 1.0601 0.2146 7.2942 8.0176 7.7823 14.1896
temp: 298.150 k
press: 1.00000 atm
elementType: 7 7 7 7 7 6 6 6 6 6 6 6 6 6 6 6 6 6 1 1 1 1 1 1 1 1 1 1 1 1 1 1 1 1 1 1
symmnumber: 1
zpe: 782784.3 jmol-1
zpe.correction: 0.298147 hartree
zpe.thermalcorrener: 0.316336 hartree
zpe.thermalcorrenthalpy: 0.317280 hartree
zpe.thermalcorrgfe: 0.250723 hartree
zpe.sumelectzpe: -778.362777 hartree
zpe.sumelectthermal: -778.344588 hartree
zpe.sumelectthermalent: -778.343644 hartree
zpe.sumelectthermalfe: -778.410201 hartree
dipole: 1.2842 0.4809 0.0192
dipole: 1.3714
quadrupole: 16.2938 -76.3211 -108.6739
quadrupole: -0.4308 -0.0193 -0.0054
quadrupole: 72.5276 -20.0873 -52.4402 -0.4308 -0.0193 -0.0054
hfenergy: -778.660924 hartree
pointgroup: C01 [X(C13H18N5)]
dipole: -0.5038767 -0.1844854 -0.0565548 debye
polarizability: 532.8234362|1.3216335|164.4659524|9.119059|23.4349534|92.0258794 unknown
InChI: InChI=1S/C13H18N5/c1-16(2)12-7-5-11(6-8-12)14-15-13-17(3)9-10-18(13)4/h5-10H,1-4H3
charge 1 multiplicity 1
36 atoms
N  -3.768213 -1.122142 -0.36734
N  -3.555803 1.002002 0.275868
N  4.894068 -0.186877 0.085332
N  -1.493747 -0.426245 -0.115168
N  -0.678495 0.595153 0.199481
C  -2.833866 -0.142058 -0.055306
C  -5.056289 -0.598083 -0.232911
C  -4.924877 0.72085 0.166399
C  3.5279 -0.019622 0.103386
C  -3.435216 -2.499344 -0.777247
C  -3.005692 2.313309 0.681235
C  0.677899 0.313613 0.143051
C  2.64082 -1.114515 -0.230942
C  2.935539 1.248237 0.456392
C  1.262462 -0.952363 -0.211597
C  1.553528 1.401088 0.473831
C  5.493242 -1.491806 -0.273338
C  5.792832 0.937812 0.426558
H  -5.947589 -1.186414 -0.426136
H  -5.68627 1.465617 0.37676
H  -2.340536 -2.595255 -0.788182
H  -3.862497 -3.219644 -0.060558
H  -3.834184 -2.699122 -1.785169
H  -3.849786 2.993812 0.873514
H  -2.395219 2.206853 1.590095
H  -2.367479 2.72283 -0.115579
H  3.056088 -2.087595 -0.503792
H  3.567757 2.100267 0.714432
H  0.601264 -1.785742 -0.465139
H  1.102613 2.361753 0.742386
H  5.175836 -2.285074 0.428347
H  6.588436 -1.413501 -0.225753
H  5.215928 -1.79242 -1.300534
H  6.83737 0.603191 0.357847
H  5.613737 1.294657 1.457661
H  5.656842 1.784577 -0.271383
