program: Gaussian 09
title: 000016261
version: EM64L-G09RevD.01
frameworkgroup: C1[X(C16H15N5)]
method: RPBEPBE
basis: SDD
operation: Freq
keyword: #pfreq=noraman
keyword: PBEPBE/SDD
title: #p freq=noraman PBEPBE/SDD
converged: YES YES NO NO
title: Mulliken charges:
elementType: N N N N N C C C C C C C C C C C C C C C C H H H H H H H H H H H H H H H
charge: -0.416264 -0.416258 -0.125018 -0.124390 -0.125716 0.453956 0.453954 0.043043 0.043381 0.066780 -0.447701 -0.319361 -0.447692 -0.319216 -0.199844 -0.225375 -0.199839 -0.225464 -0.259467 -0.259454 -0.749558 0.332968 0.332871 0.227296 0.293023 0.227378 0.292788 0.227340 0.227234 0.227336 0.227264 0.229240 0.229240 0.242414 0.242067 0.241043
chargesum: 0.00000
title: Mulliken charges with hydrogens summed into heavy atoms:
elementType: N N N N N C C C C C C C C C C C C C C C C
charge: -0.083296 -0.083387 -0.125018 -0.124390 -0.125716 0.453956 0.453954 0.043043 0.043381 0.066780 -0.220405 -0.026339 -0.220314 -0.026428 0.027496 0.001859 0.027497 0.001800 -0.030227 -0.030214 -0.024034
polarizability: 2.97998534e+02 1.16849914e-01 3.02540763e+02 1.66825239e+01 7.37942726e-01 9.09346085e+01
1716.lowfreq: -45.6642 -8.7050 -4.5580 -0.0004 0.0002 0.0007 1.5188 29.4948 36.7041
frequency: -45.6565 29.3825 36.6842 41.1593 60.1274 80.4029 114.7352 169.0881 177.6596 191.3643 225.6905 228.3586 269.9765 277.6653 296.8435 324.9492 406.5522 411.7300 423.5574 507.3737 509.3251 551.2892 589.5997 592.7064 599.1883 614.0933 615.3196 658.3074 683.4845 687.3534 698.7384 700.0400 721.1727 736.7347 765.1342 767.2582 801.5223 816.9567 835.2407 843.5495 846.1089 902.8072 908.3270 918.5879 968.6894 973.6157 984.4975 985.0265 987.0351 991.0650 997.0017 1003.9367 1024.2906 1030.1187 1051.6330 1069.0552 1087.2769 1101.6354 1170.5544 1172.1282 1184.9302 1189.4162 1190.0832 1236.9611 1253.6531 1292.5725 1312.5688 1336.4838 1350.4433 1384.7536 1393.1636 1393.7590 1421.1525 1436.9471 1447.0226 1456.3280 1457.5880 1481.8675 1482.8112 1498.4336 1514.1347 1535.7085 1571.7356 1598.9632 1604.5189 1615.8760 1617.6115 2996.4048 3087.3354 3114.8216 3114.9273 3130.8894 3131.2982 3132.0499 3144.0518 3144.2638 3165.7212 3165.8218 3201.1703 3202.2693 3518.3163 3518.9748
redmass: 1.0131 3.6932 4.8429 5.2404 4.5679 4.6262 5.1106 7.8631 4.5457 6.5027 3.5157 4.8676 4.4443 4.8205 7.0506 5.3150 2.9024 2.9787 4.1797 2.8737 2.9662 5.9879 7.1089 4.0960 4.4846 6.3571 6.4573 1.7567 5.8985 1.4066 1.8504 2.0959 2.9869 4.0048 1.7315 1.7318 6.3332 5.3647 1.5206 2.8315 1.2764 13.0317 1.4547 1.4070 1.3670 1.4185 4.4023 4.0129 2.3405 1.3679 4.5978 1.4643 2.1758 2.0292 1.6384 2.0543 1.5729 2.1327 1.0547 1.0530 1.1244 1.1131 5.2831 2.0706 3.1351 3.4050 1.5480 1.4904 2.2118 3.3753 1.6813 5.9756 3.3978 2.4711 2.4833 1.2046 1.1917 2.6015 2.3131 4.4487 2.6287 2.4705 5.2184 4.8988 4.3131 6.2882 6.0676 1.0404 1.0918 1.0882 1.0882 1.0871 1.0871 1.1019 1.0935 1.0935 1.1000 1.1000 1.0943 1.0938 1.0750 1.0750
irintensity: 0.0334 0.3087 0.0908 0.0263 0.8694 0.1261 0.4217 0.1265 1.3974 0.9830 0.3446 2.5568 4.3461 0.2345 1.8910 0.4875 0.2003 0.0494 2.1951 44.7146 0.0420 13.7437 10.2237 7.0161 4.8682 2.1269 4.3825 3.7714 1.4251 4.7389 162.0080 0.4894 2.2506 1.6867 163.0792 0.9250 75.6880 0.5560 0.8177 2.7622 0.0102 24.1170 24.6723 0.0702 0.4313 0.0029 0.1413 0.1313 3.0264 3.1705 1.1653 1.2374 6.3814 14.4726 12.2753 16.2919 2.8641 1.7377 0.0557 0.0032 2.3923 10.9075 25.6999 27.9442 2.1338 8.1197 28.8683 0.3820 1.7226 2.6581 15.3439 12.4376 410.4241 169.6270 57.4982 64.5448 336.6223 110.1170 223.1457 1512.2558 88.4622 0.9884 420.5037 49.6705 135.7034 1.3703 90.0681 8.3263 14.6548 3.3178 19.0415 1.9412 0.0014 9.7933 41.2648 16.6791 24.8895 32.0823 5.6496 4.9414 68.7745 22.6408
temp: 298.150 k
press: 1.00000 atm
elementType: 7 7 7 7 7 6 6 6 6 6 6 6 6 6 6 6 6 6 6 6 6 1 1 1 1 1 1 1 1 1 1 1 1 1 1 1
symmnumber: 1
zpe: 743248.9 jmol-1
zpe.correction: 0.283089 hartree
zpe.thermalcorrener: 0.299884 hartree
zpe.thermalcorrenthalpy: 0.300829 hartree
zpe.thermalcorrgfe: 0.236816 hartree
zpe.sumelectzpe: -891.032347 hartree
zpe.sumelectthermal: -891.015551 hartree
zpe.sumelectthermalent: -891.014607 hartree
zpe.sumelectthermalfe: -891.078620 hartree
dipole: 0.0002 -0.3417 0.0808
dipole: 0.3511
quadrupole: -102.3207 -111.1393 -128.8275
quadrupole: 0.0079 4.4145 0.3808
quadrupole: 11.7751 2.9565 -14.7316 0.0079 4.4145 0.3808
hfenergy: -891.3154359 hartree
pointgroup: C01 [X(C16H15N5)]
dipole: 0.0009363 -0.1343687 -0.0320433 debye
polarizability: 297.1160634|-0.1499795|302.5422127|21.4567038|-0.3093134|91.8156289 unknown
InChI: InChI=1S/C16H15N5/c1-12-17-15(19-13-8-4-2-5-9-13)21-16(18-12)20-14-10-6-3-7-11-14/h2-11,19-20H,1H3
charge 0 multiplicity 1
36 atoms
N  2.38606 0.960379 0.121157
N  -2.390708 0.952754 -0.10164
N  -0.002115 0.813166 0.00969
N  -1.212924 2.937463 -0.058797
N  1.201297 2.941211 0.096606
C  2.786748 -0.399651 0.047186
C  -2.786048 -0.409417 -0.038359
C  1.143597 1.559013 0.068608
C  -1.150471 1.555638 -0.044599
C  -0.006774 3.574603 0.019821
C  4.141918 -0.688598 0.37075
C  1.926404 -1.453367 -0.360545
C  -4.138578 -0.701969 -0.369499
C  -1.92292 -1.462075 0.366151
C  4.627314 -2.008867 0.292792
C  2.427354 -2.770918 -0.432267
C  -4.61862 -2.024801 -0.302221
C  -2.418408 -2.782239 0.42696
C  3.771726 -3.062589 -0.106631
C  -3.760145 -3.077473 0.093737
C  -0.008054 5.079883 -0.004593
H  3.131471 1.655125 0.226216
H  -3.1388 1.645403 -0.201286
H  4.810953 0.122149 0.686573
H  0.892214 -1.228877 -0.623171
H  -4.809689 0.107962 -0.682983
H  -0.890855 -1.234903 0.634831
H  5.673163 -2.214276 0.546417
H  1.756369 -3.575477 -0.75436
H  -5.662517 -2.233009 -0.561544
H  -1.745363 -3.586034 0.746645
H  4.148226 -4.089096 -0.166341
H  -4.13247 -4.105955 0.145083
H  0.880977 5.471433 0.513534
H  -0.929337 5.470405 0.455214
H  0.023706 5.437903 -1.051136
