program: Gaussian 09
title: 000113080
version: EM64L-G09RevD.01
frameworkgroup: C1[X(C11H13NO3S3)]
method: RPBEPBE
basis: SDD
operation: Freq
keyword: #p
keyword: freq=noraman
keyword: PBEPBE/SDD
title: #p freq=noraman PBEPBE/SDD
converged: YES YES NO NO
title: Mulliken charges:
elementType: S S S O O O N C C C C C C C C C C C H H H H H H H H H H H H H
charge: 1.098086 0.383082 0.346743 -0.636763 -0.569711 -0.622922 -0.058409 -0.425057 -0.391169 0.677453 -0.634879 -0.464346 -0.412503 -0.311123 -0.261043 -0.229276 -0.227802 -0.852607 0.239083 0.316062 0.279116 0.231170 0.279907 0.255292 0.273863 0.259910 0.248025 0.249790 0.353661 0.341039 0.265329
chargesum: 0.00000
title: Mulliken charges with hydrogens summed into heavy atoms:
elementType: S S S O O O N C C C C C C C C C C C
charge: 1.098086 0.383082 0.346743 -0.636763 -0.569711 -0.622922 -0.058409 0.130088 0.119117 0.677453 -0.099679 -0.464346 -0.412503 -0.037260 -0.001134 0.018749 0.021987 0.107421
polarizability: 3.45102642e+02 1.45134239e+01 2.30336614e+02 7.20097800e+00 -4.20429867e+00 1.04951326e+02
1716.lowfreq: -2.3016 -0.0026 -0.0002 0.0006 8.0345 11.8288 37.3868 38.4348 74.8535
frequency: 37.3452 37.9611 74.8444 79.8199 104.8809 115.7248 146.7164 168.8460 184.7848 197.0001 218.6423 236.4546 245.1690 263.5467 274.5050 313.1706 326.5691 351.3061 354.3846 358.8617 374.7104 405.6277 429.0366 446.1455 494.2669 504.8722 539.0048 559.7789 592.4210 596.4702 645.0910 686.5527 704.9064 724.6744 753.4435 761.3801 777.8898 811.3879 846.1824 857.7288 896.0545 903.6945 932.4908 947.4350 992.1833 993.2134 1007.8060 1021.4176 1025.2075 1029.7359 1077.0110 1100.2463 1139.4808 1142.9163 1170.4847 1184.5464 1237.7506 1268.4876 1275.2138 1291.9969 1319.9051 1350.0070 1363.9810 1396.1822 1401.2331 1414.4286 1438.3515 1447.7130 1451.2804 1454.4598 1470.5147 1502.1138 1591.9783 1597.2639 2937.7082 2982.5948 3004.8572 3033.7526 3052.4620 3067.3867 3070.1861 3127.7125 3142.8279 3152.1760 3163.2747 3176.1930 3185.9902
redmass: 7.1185 4.8686 7.8558 5.6799 6.2984 8.1706 5.1306 5.4737 5.8626 5.5658 3.6206 4.5730 4.5724 1.5176 1.7478 3.3064 4.0193 8.3637 8.2481 10.3099 6.3536 7.2228 3.2048 5.8586 7.5666 5.6427 6.4202 4.4560 5.7913 7.4516 5.5274 5.9760 12.8617 3.4631 2.9368 1.3844 2.7591 2.4142 1.9119 1.3521 5.3768 9.7803 1.2857 1.3695 1.3564 2.2745 1.5928 4.3102 1.3545 2.2091 3.0839 4.0342 1.5138 1.3994 1.2866 1.1247 1.5468 2.0026 1.6420 1.2078 1.2242 1.3387 1.1914 2.7046 8.2377 1.1071 1.0475 1.7295 2.0529 1.4810 1.1564 1.0902 7.0230 6.9382 1.0372 1.0598 1.0608 1.0964 1.0623 1.1011 1.1014 1.1057 1.1099 1.0868 1.0910 1.0957 1.0999
irintensity: 3.2776 2.8335 1.7409 4.8229 1.8287 15.1716 4.7140 0.8003 1.0919 8.2879 0.6918 2.1921 2.4790 1.0368 1.7313 2.3020 7.4814 2.6786 9.5628 40.0462 10.9948 3.3746 6.3369 4.6247 2.0834 2.8426 37.8093 4.9971 3.3262 16.4074 2.7407 8.9582 81.1017 9.4402 33.3965 77.3296 67.1290 1.2977 28.9766 0.5864 51.0704 175.6296 0.8487 1.2080 0.4682 13.2245 7.5200 12.1673 0.9309 1.8875 3.4100 44.1093 9.6887 3.4504 9.8761 5.4464 5.0932 13.0669 13.9918 2.2895 8.5353 59.7109 24.0641 115.1263 24.2040 8.9827 24.2405 29.8078 38.2528 32.6230 55.9143 18.9547 3.1789 2.8456 193.0002 44.3758 44.0082 6.9382 6.0121 14.3410 7.9138 25.9110 2.7765 0.6120 3.5244 7.6219 5.2285
temp: 298.150 k
press: 1.00000 atm
elementType: 16 16 16 8 8 8 7 6 6 6 6 6 6 6 6 6 6 6 1 1 1 1 1 1 1 1 1 1 1 1 1
symmnumber: 1
zpe: 589376.2 jmol-1
zpe.correction: 0.224482 hartree
zpe.thermalcorrener: 0.242718 hartree
zpe.thermalcorrenthalpy: 0.243662 hartree
zpe.thermalcorrgfe: 0.177990 hartree
zpe.sumelectzpe: -1900.013877 hartree
zpe.sumelectthermal: -1899.995640 hartree
zpe.sumelectthermalent: -1899.994696 hartree
zpe.sumelectthermalfe: -1900.060368 hartree
dipole: -16.5485 -0.9305 0.1662
dipole: 16.5755
quadrupole: -163.1311 -111.9777 -138.6521
quadrupole: 14.3604 1.7357 -0.5443
quadrupole: -25.2108 25.9426 -0.7318 14.3604 1.7357 -0.5443
hfenergy: -1900.2383582 hartree
pointgroup: C01 [X(C11H13N1O3S3)]
dipole: -6.2533779 1.8411246 0.1809223 debye
polarizability: 329.3871449|-44.0008413|234.2919725|-22.7017171|-30.1068103|116.7114649 unknown
InChI: InChI=1S/C11H13NO3S3/c1-16-11-12(7-4-8-18(13,14)15)9-5-2-3-6-10(9)17-11/h2-3,5-6H,4,7-8H2,1H3
charge 0 multiplicity 1
31 atoms
S  3.67038 -0.802777 -0.202992
S  -3.055374 -1.576819 1.054332
S  -0.667247 -3.313588 0.593818
O  2.928348 -1.70964 -1.3991
O  5.233556 -0.431647 -0.463004
O  3.287452 -1.353232 1.328407
N  -0.933539 -0.51829 -0.120052
C  0.424518 -0.246557 -0.684634
C  1.270779 0.635336 0.269436
C  -1.921518 0.514842 -0.145583
C  2.678231 0.87863 -0.280533
C  -1.350636 -1.688603 0.442656
C  -3.156379 0.121803 0.428471
C  -1.777808 1.805461 -0.703731
C  -4.264998 0.985058 0.473962
C  -2.885429 2.67561 -0.663159
C  -4.115199 2.276076 -0.078962
C  1.236719 -3.310559 0.561897
H  0.272078 0.253522 -1.658649
H  0.966143 -1.184069 -0.901353
H  1.378594 0.129955 1.24877
H  0.772135 1.60785 0.446377
H  3.261537 1.561703 0.355798
H  2.72983 1.175039 -1.340563
H  -0.839776 2.126036 -1.163022
H  -5.213784 0.671536 0.918564
H  -2.791662 3.677681 -1.092635
H  -4.959217 2.972103 -0.057959
H  1.685524 -2.532072 1.210658
H  1.629367 -3.176761 -0.458897
H  1.455578 -4.317329 0.955281
