program: Gaussian 09
title: 000113078
version: EM64L-G09RevD.01
frameworkgroup: C1[X(C16H17NO3S2)]
method: RPBEPBE
basis: SDD
operation: Freq
keyword: #p
keyword: freq=noraman
keyword: PBEPBE/SDD
title: #p freq=noraman PBEPBE/SDD
converged: NO YES NO NO
title: Mulliken charges:
elementType: S S O O O N C C C C C C C C C C C C C C C C H H H H H H H H H H H H H H H H H
charge: 1.020467 0.214648 -0.517128 -0.585386 -0.510509 -0.249964 -0.415634 -0.461798 -0.285681 0.714738 0.144113 -0.479681 -0.682630 -0.595888 0.434468 -0.511659 0.388040 -0.700147 -0.436432 -0.426057 -0.245694 -0.248774 0.292531 0.250916 0.285761 0.232858 0.312423 0.243269 0.273327 0.235734 0.237251 0.249142 0.383350 0.230351 0.280428 0.234045 0.240578 0.226369 0.228254
chargesum: 0.00000
title: Mulliken charges with hydrogens summed into heavy atoms:
elementType: S S O O O N C C C C C C C C C C C C C C C C
charge: 1.020467 0.214648 -0.517128 -0.202035 -0.510509 -0.249964 0.127813 0.056821 0.026741 0.714738 0.144113 -0.479681 0.069700 -0.358636 0.434468 -0.262517 0.388040 -0.189368 -0.202388 -0.185479 -0.019325 -0.020520
polarizability: 3.73909665e+02 6.58583717e+01 2.73014702e+02 8.43446389e+00 -8.25177101e+00 1.31633418e+02
1716.lowfreq: -9.6051 -4.4223 -0.0024 -0.0021 -0.0008 0.6725 12.8755 20.5255 32.1459
frequency: 10.5838 20.4336 32.0947 43.0277 75.7638 84.8192 102.4596 124.2569 150.4217 168.1164 172.9847 192.2387 201.9754 211.4142 233.2981 240.2631 269.6934 297.2550 313.4029 321.5893 328.4330 332.9257 363.6449 379.5833 390.7392 413.8683 436.3242 444.3654 469.5598 473.6996 516.0075 526.3389 543.4508 557.1675 573.1432 601.0269 608.8722 644.8593 667.8067 690.8777 726.0774 752.0530 764.1149 774.4109 783.1971 829.3131 831.8240 837.8584 867.0141 868.8981 899.9598 900.9994 928.9200 953.9533 955.8492 963.8129 983.7162 999.6923 1018.7537 1024.9798 1031.8013 1064.5316 1086.6738 1111.7654 1131.7006 1136.9891 1165.6285 1172.8290 1208.0855 1219.9462 1233.6864 1257.6359 1268.3581 1272.2465 1311.2344 1324.4091 1345.0966 1356.8716 1384.4542 1397.0198 1411.6059 1422.0201 1427.7900 1438.8484 1445.6232 1456.5822 1472.3167 1475.1327 1488.4951 1509.5676 1588.4042 1607.4325 1626.8985 1630.3788 2981.0972 2991.3741 3018.4533 3044.1624 3060.1880 3083.2502 3085.8777 3108.1968 3115.8621 3117.0246 3123.4605 3136.6668 3141.6265 3144.6444 3162.2715 3229.3913 3496.8883
redmass: 9.4279 4.9734 6.4930 4.5536 6.6306 5.2088 5.4879 4.7284 4.0540 3.7451 2.1383 1.6952 3.0126 1.9359 3.0247 4.5475 5.0034 2.5924 8.7574 4.0699 4.5555 4.6443 3.4233 4.1644 4.6791 3.6578 4.2185 4.8173 3.5080 2.6450 6.2586 3.9351 11.9992 3.8162 6.8815 4.7313 5.2433 1.2696 5.2324 4.8682 2.5405 1.2712 1.8978 2.1710 2.5574 1.3302 1.3999 9.4391 1.8732 2.5787 1.9348 1.9328 2.5867 5.7179 1.4050 2.3563 1.3345 2.3373 1.8579 2.2239 1.5946 1.6076 2.4800 2.3643 1.6766 2.0900 1.4445 1.1096 1.6139 1.5770 1.7195 1.6127 1.4501 1.6732 1.4910 2.6719 1.5442 1.7072 1.3558 1.1902 7.2793 1.2728 2.3476 1.1066 2.8700 1.0462 4.3327 1.0549 1.1287 3.9454 7.8190 6.4826 6.6130 6.5394 1.0623 1.0379 1.0628 1.0935 1.0893 1.1024 1.0975 1.1008 1.0628 1.0863 1.0887 1.0908 1.0941 1.0923 1.1002 1.1141 1.0664
irintensity: 0.0179 1.3957 0.7101 0.1554 2.7557 0.5232 0.1139 1.2972 3.7440 4.1048 1.4633 8.7778 2.0167 19.8012 7.7409 24.7708 3.1266 104.5597 8.1730 1.4131 4.8800 0.5526 1.4689 21.8987 2.3893 2.0323 4.2434 1.2452 7.5064 16.8655 3.5411 3.6088 123.7466 1.5572 1.1736 4.8082 15.7339 1.0171 0.5840 2.2060 11.8888 44.4287 9.8347 4.7953 0.7657 106.9124 17.1756 41.3605 39.3216 35.4967 4.9995 0.5753 16.3017 87.7086 7.7454 43.6126 0.0037 16.0284 14.2675 14.8509 34.8160 25.5047 3.1367 18.0445 7.6091 14.3973 19.9774 1.0589 24.0307 32.9948 79.9077 15.5627 3.4442 4.5696 26.2585 33.3702 15.2854 57.4733 13.1023 17.5174 3.4446 13.9711 0.3994 11.6504 3.9313 16.6800 194.2590 10.2774 42.0706 1.1957 51.9275 46.0914 283.5862 73.5607 4.8279 7.8787 16.3259 0.6114 1.8052 1.4488 7.1792 7.3718 22.3151 7.1098 0.7800 17.7440 33.2903 6.6180 42.5353 1.5090 50.0695
temp: 298.150 k
press: 1.00000 atm
elementType: 16 16 8 8 8 7 6 6 6 6 6 6 6 6 6 6 6 6 6 6 6 6 1 1 1 1 1 1 1 1 1 1 1 1 1 1 1 1 1
symmnumber: 1
zpe: 774083.6 jmol-1
zpe.correction: 0.294833 hartree
zpe.thermalcorrener: 0.316775 hartree
zpe.thermalcorrenthalpy: 0.317719 hartree
zpe.thermalcorrgfe: 0.241659 hartree
zpe.sumelectzpe: -1694.681102 hartree
zpe.sumelectthermal: -1694.659160 hartree
zpe.sumelectthermalent: -1694.658216 hartree
zpe.sumelectthermalfe: -1694.734276 hartree
dipole: -1.3866 -3.6315 -0.2896
dipole: 3.8980
quadrupole: -158.5490 -141.1256 -144.3582
quadrupole: -4.3483 6.0409 1.7900
quadrupole: -10.5380 6.8853 3.6527 -4.3483 6.0409 1.7900
hfenergy: -1694.9759352 hartree
pointgroup: C01 [X(C16H17N1O3S2)]
dipole: -0.4699016 -1.3554976 0.5419678 debye
polarizability: 361.0016798|82.1547262|247.3637137|4.0351065|-57.5243593|170.192391 unknown
InChI: InChI=1S/C16H17NO3S2/c1-11(22(18,19)20)7-8-17-12(2)21-16-10-14-6-4-3-5-13(14)9-15(16)17/h3-6,9-11,18H,2,7-8H2,1H3
charge 0 multiplicity 1
39 atoms
S  4.660437 0.536034 1.067983
S  -1.225084 2.86205 -1.761603
O  4.465552 1.833313 0.114914
O  3.988938 0.942505 2.769388
O  6.140752 -0.097344 1.216693
N  0.193068 1.354654 -0.07124
C  2.136976 -0.211175 -0.060084
C  1.30744 0.833987 0.729561
C  3.255346 -0.873825 0.738568
C  -1.083503 0.761251 -0.072781
C  0.381813 2.45812 -0.941863
C  -2.017131 1.447407 -0.92873
C  3.977573 -2.036213 0.065276
C  -1.499278 -0.360609 0.649793
C  -2.856156 -0.816989 0.545341
C  -3.333224 1.033356 -1.054841
C  -3.788609 -0.114292 -0.316624
C  1.531182 3.147511 -1.177824
C  -3.323144 -1.960421 1.273054
C  -5.13844 -0.581656 -0.413023
C  -4.647736 -2.394392 1.159716
C  -5.564506 -1.700525 0.310102
H  2.543379 0.255782 -0.976573
H  1.464231 -1.028908 -0.391491
H  1.944659 1.679698 1.037966
H  0.902611 0.386314 1.655237
H  2.989099 -1.076436 1.790814
H  4.232947 -1.80795 -0.983544
H  4.901993 -2.310522 0.60098
H  3.304098 -2.913828 0.072811
H  -0.809244 -0.903455 1.304543
H  -4.034257 1.564996 -1.706911
H  4.582502 1.631003 3.186291
H  1.52872 3.996125 -1.864209
H  2.484741 2.8786 -0.713384
H  -2.623692 -2.494252 1.928144
H  -5.838675 -0.04647 -1.065562
H  -4.989002 -3.269336 1.723925
H  -6.599977 -2.048106 0.228791
