program: Gaussian 09
title: 000112609
version: EM64L-G09RevD.01
frameworkgroup: C1[X(C12H15NO3S2)]
method: RPBEPBE
basis: SDD
operation: Freq
keyword: #p
keyword: freq=noraman
keyword: PBEPBE/SDD
title: #p freq=noraman PBEPBE/SDD
converged: YES YES NO NO
title: Mulliken charges:
elementType: S S O O O N C C C C C C C C C C C C H H H H H H H H H H H H H H H
charge: 1.018503 0.215229 -0.520462 -0.575285 -0.516884 -0.239842 -0.341923 -0.327779 -0.486656 0.616924 0.151131 -0.673490 -0.388893 -0.344461 -0.681982 -0.276628 -0.233475 -0.251340 0.275492 0.234880 0.339811 0.240289 0.249043 0.242086 0.272484 0.223861 0.240090 0.213350 0.379125 0.241510 0.243717 0.229097 0.232478
chargesum: 0.00000
title: Mulliken charges with hydrogens summed into heavy atoms:
elementType: S S O O O N C C C C C C C C C C C C
charge: 1.018503 0.215229 -0.520462 -0.196160 -0.516884 -0.239842 0.168449 0.012032 0.002676 0.616924 0.151131 0.064941 -0.388893 -0.104371 -0.227122 -0.032911 -0.004379 -0.018862
polarizability: 2.24842599e+02 3.52815553e+01 2.20099083e+02 2.03073937e+01 -1.11611307e+01 1.46744292e+02
1716.lowfreq: -12.4321 -8.1592 -7.6919 -0.0016 -0.0008 -0.0005 19.9451 22.0499 30.5422
frequency: 19.7199 21.9378 30.2767 56.2859 80.6786 104.5323 114.7720 134.4075 161.5975 173.0973 181.4181 191.1098 228.4053 259.4060 272.8827 276.8032 299.7614 333.2056 356.9945 375.0007 403.2710 410.7468 427.9960 436.3933 468.9846 487.3428 499.8780 530.4654 538.5490 552.5742 573.7942 616.8027 657.4807 678.4878 718.1757 744.8602 747.2756 766.5040 806.6704 837.6651 838.5203 879.7270 918.5937 921.1087 952.1650 968.7394 976.3308 989.1584 1011.6369 1025.0808 1035.3658 1053.1158 1083.6895 1116.5699 1130.6483 1137.0233 1172.7037 1191.7173 1200.4623 1240.7139 1268.4164 1303.9354 1317.9495 1339.6804 1352.1724 1358.4328 1391.7536 1402.1009 1417.3478 1444.4961 1454.6781 1459.2300 1468.2911 1471.8025 1490.2472 1587.4992 1600.7519 1623.5478 2990.9672 3005.3311 3013.1963 3064.5170 3074.0760 3080.3312 3085.8792 3105.7285 3136.6406 3139.2368 3147.6865 3158.2183 3173.6025 3242.7610 3499.5461
redmass: 6.6010 10.6850 6.3118 4.8923 3.4745 4.3704 6.5550 3.9477 1.4701 2.8321 1.5411 4.1688 3.9295 3.0787 3.4365 3.5646 6.8021 5.8696 2.9016 3.9516 2.6266 4.1019 3.7640 4.4044 6.6477 6.5053 2.4833 3.9762 5.3413 4.4375 2.3928 1.8193 4.4542 5.5568 3.2300 1.4935 2.6629 1.3432 2.3579 2.3915 2.4348 2.0171 1.8226 1.3786 5.2581 1.3144 2.3765 1.8128 1.6434 3.8023 1.7191 1.7651 2.6996 2.1172 1.5659 2.2334 1.1031 1.5825 1.3051 1.4022 1.3319 2.4310 1.5119 1.7454 1.3102 1.3974 1.2033 5.3958 1.2506 2.3209 1.0892 1.0528 2.9046 1.0880 1.0913 6.7184 7.1217 6.3360 1.0364 1.0608 1.0623 1.0993 1.0957 1.1002 1.0943 1.0998 1.0853 1.0609 1.0895 1.0949 1.1005 1.1138 1.0665
irintensity: 0.4181 0.3203 1.2278 0.7162 0.2719 0.8103 3.1767 2.7074 0.5756 0.9678 31.7303 5.3489 37.6901 20.8039 38.1829 0.7443 24.5462 8.3141 1.9164 35.4388 5.1037 0.9677 0.6928 5.9917 2.4647 0.3490 5.3191 10.8825 46.7094 39.0732 26.0491 1.0128 0.8692 7.3541 7.9259 94.1794 10.3553 135.5452 20.4192 32.3007 28.6265 5.4543 10.8716 2.2154 66.2555 0.1913 35.4308 1.0549 34.6091 23.9980 26.4608 14.7473 18.7445 21.5329 11.4705 13.5929 2.8847 27.3574 42.8712 10.3376 9.6395 56.9039 48.7367 34.7554 21.0329 4.5066 39.7161 3.1035 3.6532 5.7948 7.3122 12.1888 111.2133 15.8118 35.5805 60.7037 15.7457 337.2795 9.6523 3.8439 35.0550 4.8636 13.5148 9.3655 6.2387 5.4632 2.8752 4.0387 8.0451 20.7247 16.4676 6.5760 39.0999
temp: 298.150 k
press: 1.00000 atm
elementType: 16 16 8 8 8 7 6 6 6 6 6 6 6 6 6 6 6 6 1 1 1 1 1 1 1 1 1 1 1 1 1 1 1
symmnumber: 1
zpe: 652499.1 jmol-1
zpe.correction: 0.248524 hartree
zpe.thermalcorrener: 0.267879 hartree
zpe.thermalcorrenthalpy: 0.268823 hartree
zpe.thermalcorrgfe: 0.198921 hartree
zpe.sumelectzpe: -1541.289283 hartree
zpe.sumelectthermal: -1541.269928 hartree
zpe.sumelectthermalent: -1541.268983 hartree
zpe.sumelectthermalfe: -1541.338886 hartree
dipole: -2.9627 0.3706 2.6213
dipole: 3.9732
quadrupole: -142.1715 -117.3597 -117.7096
quadrupole: 13.4358 8.3917 5.5576
quadrupole: -16.4245 8.3872 8.0373 13.4358 8.3917 5.5576
hfenergy: -1541.5378067 hartree
pointgroup: C01 [X(C12H15N1O3S2)]
dipole: 1.0743871 -0.358726 -1.0772661 debye
polarizability: 237.988025|-17.6074018|201.8697202|29.824436|-25.0465177|151.8282288 unknown
InChI: InChI=1S/C12H15NO3S2/c1-9(18(14,15)16)7-8-13-10(2)17-12-6-4-3-5-11(12)13/h3-6,9,14H,2,7-8H2,1H3
charge 0 multiplicity 1
33 atoms
S  -3.088828 -0.44705 1.325946
S  2.320925 2.50903 -0.387841
O  -3.433161 -2.028168 1.21479
O  -1.555962 -0.238339 2.377935
O  -4.244858 0.568785 1.826803
N  0.863819 0.423687 -1.202327
C  -1.256021 -0.901884 -0.787432
C  -2.182647 0.221148 -0.316842
C  -0.186834 -0.405819 -1.806402
C  1.947537 -0.149259 -0.497528
C  0.842446 1.837848 -1.263961
C  -3.314545 0.632399 -1.256527
C  2.857405 0.813343 0.018267
C  2.191581 -1.524715 -0.285316
C  -0.083181 2.64699 -1.856183
C  4.001612 0.43714 0.734825
C  3.347449 -1.909651 0.435071
C  4.246541 -0.944797 0.942608
H  -0.729573 -1.343243 0.077858
H  -1.8524 -1.705952 -1.258025
H  -1.638497 1.080457 0.109857
H  -0.650874 0.15585 -2.634579
H  0.290959 -1.293369 -2.260542
H  -3.933852 -0.23276 -1.553263
H  -3.964852 1.394028 -0.794516
H  -2.884346 1.072703 -2.174671
H  1.505189 -2.28896 -0.662392
H  -0.952903 2.257389 -2.389359
H  -1.761725 -0.586266 3.292287
H  0.039787 3.730557 -1.836522
H  4.693339 1.189887 1.125537
H  3.54025 -2.974584 0.60249
H  5.134416 -1.258925 1.500252
