program: Gaussian 09
title: 000016244
version: EM64L-G09RevD.01
frameworkgroup: C1[X(C11H13NOS)]
method: RPBEPBE
basis: SDD
operation: Freq
keyword: #p
keyword: freq=noraman
keyword: PBEPBE/SDD
title: #p freq=noraman PBEPBE/SDD
converged: NO YES NO NO
title: Mulliken charges:
elementType: S O N C C C C C C C C C C C H H H H H H H H H H H H H
charge: -0.041049 -0.240302 -0.048850 -0.387596 -0.353680 -0.295689 -0.303652 -0.408470 0.434510 -0.362020 -0.356076 -0.230650 -0.217746 -0.232940 0.245769 0.258804 0.258325 0.232951 0.192352 0.227074 0.229269 0.201402 0.240748 0.264375 0.230545 0.230408 0.232189
chargesum: 0.00000
title: Mulliken charges with hydrogens summed into heavy atoms:
elementType: S O N C C C C C C C C C C C
charge: -0.041049 -0.240302 -0.048850 0.116978 0.137596 0.123737 0.127018 -0.408470 0.434510 -0.121272 -0.091701 -0.000105 0.012661 -0.000750
polarizability: 1.84286317e+02 -1.00367715e+01 1.57635814e+02 4.79216836e+00 5.86637746e+00 9.43497849e+01
1716.lowfreq: -9.0730 -0.0016 -0.0014 0.0018 6.6915 12.7297 41.0431 59.0209 63.5417
frequency: 41.0056 58.8191 63.4380 91.6140 178.1132 200.2288 249.5067 279.7718 291.9808 323.9729 396.0771 402.9798 417.7412 458.5228 505.2611 513.4630 596.2345 612.5285 627.4161 670.5461 699.9608 767.7378 792.6912 830.6983 842.1154 853.5709 892.2513 926.2554 976.1041 981.1726 987.4486 996.2681 1012.2221 1016.9596 1030.6808 1049.3032 1071.8642 1080.6869 1103.3935 1162.9456 1172.8711 1186.5353 1188.6969 1207.0323 1249.2055 1271.1803 1276.3438 1311.8073 1324.0433 1339.5972 1350.4436 1365.7018 1374.9398 1423.5021 1430.9936 1447.3724 1453.3782 1455.6933 1467.1120 1478.6779 1579.9573 1604.7956 2947.2444 2958.1614 2979.5463 2985.4003 3065.6251 3085.1593 3091.4816 3106.7969 3121.6363 3132.0204 3143.3695 3154.9871 3168.0889
redmass: 4.3087 4.3304 4.2185 4.5479 3.3165 5.4177 3.8937 4.3950 3.1562 3.5657 3.7026 2.9193 2.0334 2.8002 4.8916 3.9815 3.2708 3.6445 6.2765 4.2020 1.8045 1.8585 4.3044 1.6790 3.8677 1.2557 2.6371 1.4338 1.6489 2.9534 5.8489 1.3497 2.5231 2.5305 2.0675 2.0373 4.0113 1.6106 2.2055 3.8438 1.0578 1.1127 1.0715 1.6299 1.4330 1.6492 1.6980 1.3585 1.2661 1.2428 1.3710 1.2910 6.6812 2.5589 2.1950 1.0821 1.0808 1.1136 1.2264 2.2943 5.9231 6.1036 1.0683 1.0682 1.0675 1.0625 1.0991 1.0959 1.0976 1.0938 1.0860 1.0874 1.0924 1.0959 1.1012
irintensity: 0.7969 2.6177 0.2416 0.8176 3.9851 3.0696 1.5477 7.2519 7.6574 6.3820 4.0349 1.1819 0.2212 0.0950 9.5512 10.9541 5.2325 5.9275 3.3354 2.6356 41.0068 68.8146 10.6365 0.1173 15.3230 2.6478 0.0459 6.4999 13.5804 16.4215 0.7957 0.6393 11.5857 47.1324 5.8117 26.5589 35.2281 13.5793 6.1253 1.8615 0.0287 1.9145 5.0050 128.2844 47.5385 37.0242 64.7522 4.5056 3.2924 0.6725 3.2581 0.4006 1.3669 113.4428 51.8774 5.3454 11.1315 12.5506 24.6669 12.5200 1.4014 0.5067 44.2406 51.5309 29.1072 65.3740 16.0255 31.9938 33.3305 7.0338 4.2516 1.0772 21.1583 22.0749 19.9982
temp: 298.150 k
press: 1.00000 atm
elementType: 16 8 7 6 6 6 6 6 6 6 6 6 6 6 1 1 1 1 1 1 1 1 1 1 1 1 1
symmnumber: 1
zpe: 573926.1 jmol-1
zpe.correction: 0.218597 hartree
zpe.thermalcorrener: 0.230947 hartree
zpe.thermalcorrenthalpy: 0.231891 hartree
zpe.thermalcorrgfe: 0.178773 hartree
zpe.sumelectzpe: -953.956180 hartree
zpe.sumelectthermal: -953.943831 hartree
zpe.sumelectthermalent: -953.942887 hartree
zpe.sumelectthermalfe: -953.996004 hartree
dipole: 0.2046 -3.5266 0.8403
dipole: 3.6310
quadrupole: -86.3391 -96.1488 -88.6587
quadrupole: -8.5174 3.4559 4.3884
quadrupole: 4.0431 -5.7666 1.7235 -8.5174 3.4559 4.3884
hfenergy: -954.1747773 hartree
pointgroup: C01 [X(C11H13N1O1S1)]
dipole: -0.1365336 -1.4218041 -0.025059 debye
polarizability: 184.4006877|10.8876441|151.1709749|7.9128182|-18.295974|100.700254 unknown
InChI: InChI=1S/C11H13NOS/c14-11(10-4-2-1-3-5-10)12-6-8-13-9-7-12/h1-5H,6-9H2
charge 0 multiplicity 1
27 atoms
S  0.157228 2.82896 -0.262785
O  3.541951 -1.314127 0.431078
N  1.270658 0.328439 -0.293847
C  1.311792 -1.117946 -0.63868
C  2.629151 0.917407 -0.217373
C  2.186466 -1.879942 0.376523
C  3.479077 0.11491 0.787199
C  0.13027 1.105342 -0.262218
C  -1.189743 0.399703 -0.169445
C  -1.441114 -0.54865 0.861376
C  -2.240694 0.736175 -1.062278
C  -2.713357 -1.147623 0.990273
C  -3.503748 0.11868 -0.946662
C  -3.746444 -0.824627 0.080519
H  1.764726 -1.217313 -1.646436
H  0.29398 -1.532782 -0.670999
H  2.53191 1.974421 0.084712
H  3.096894 0.883407 -1.221667
H  1.718144 -1.843977 1.384693
H  2.315723 -2.930542 0.069165
H  4.523346 0.466266 0.779107
H  3.057772 0.230185 1.809173
H  -0.652116 -0.783878 1.585537
H  -2.05472 1.4937 -1.830662
H  -2.898915 -1.858438 1.803293
H  -4.302271 0.381627 -1.649068
H  -4.732268 -1.292775 0.177174
