program: Gaussian 09
title: 000112226
version: EM64L-G09RevD.01
frameworkgroup: C1[X(C13H20O)]
method: RPBEPBE
basis: SDD
operation: Freq
keyword: #pfreq=noraman
keyword: PBEPBE/SDD
title: #p freq=noraman PBEPBE/SDD
converged: NO YES NO NO
title: Mulliken charges:
elementType: O C C C C C C C C C C C C C H H H H H H H H H H H H H H H H H H H H
charge: -0.191231 0.214607 0.185837 0.198956 -0.432882 -0.568527 -0.513184 -0.454575 -0.160839 -0.526285 -0.452455 -0.745727 -0.757789 -0.110848 0.196349 0.198081 0.233207 0.218721 0.214237 0.214739 0.206937 0.206006 0.243404 0.226976 0.219630 0.233661 0.213361 0.215410 0.226532 0.208531 0.214403 0.222851 0.218513 0.183394
chargesum: 0.00000
title: Mulliken charges with hydrogens summed into heavy atoms:
elementType: O C C C C C C C C C C C C C
charge: -0.191231 0.214607 0.185837 0.198956 -0.038451 -0.116599 -0.084209 -0.041633 0.082566 -0.079679 -0.005433 -0.095254 -0.102022 0.072546
polarizability: 1.50961211e+02 -2.22009700e+00 1.39858156e+02 6.43069251e-01 1.37019791e+00 1.14209743e+02
1716.lowfreq: -10.3416 -7.3403 -0.0010 -0.0006 0.0004 14.8240 36.7186 57.6769 81.7873
frequency: 36.0074 56.6907 81.6650 118.3190 186.6204 190.7934 234.0205 243.3573 266.1805 276.1056 291.9565 315.3441 336.0873 348.0438 377.7692 387.5694 413.8563 459.5002 474.8273 514.7226 558.6418 602.3836 605.7716 689.6008 778.6632 810.1520 847.1966 861.7394 875.0126 883.7237 916.1947 924.9708 940.7086 961.0446 979.1566 989.6193 995.0542 1031.9073 1036.6521 1060.0521 1081.5763 1109.2650 1120.2456 1132.7842 1156.5966 1159.4704 1176.7173 1185.8730 1203.8148 1215.7277 1224.6578 1260.1668 1274.0453 1278.9909 1310.1041 1333.5563 1339.5636 1340.4530 1342.3264 1346.4242 1363.3046 1372.4297 1383.0613 1393.0435 1452.0554 1453.2712 1458.3509 1464.3475 1466.2674 1468.1213 1476.4811 1480.5880 1484.4300 1493.2440 1638.1679 1677.8137 2860.6500 2938.2882 2944.7412 2959.3639 2965.7133 2970.1968 2976.1831 2979.1856 2981.2020 2994.0576 2996.8380 3001.3446 3016.7657 3025.8883 3043.0275 3054.8480 3062.0699 3067.8138 3072.7042 3080.1295
redmass: 5.4567 4.2958 2.7048 2.5014 2.2279 1.5785 1.5030 2.6919 2.0227 1.0801 2.3832 2.6102 1.9917 2.1476 3.1855 2.5845 2.9428 3.0497 3.1644 2.8807 3.0700 3.2454 2.9337 2.7522 2.3624 1.7711 2.7574 1.5630 2.1297 2.2403 1.9633 1.5134 1.9461 2.0320 1.8208 1.6483 1.6002 1.9384 2.0371 2.0186 1.8119 1.9475 1.5107 1.9541 1.4227 1.3277 2.3121 1.9350 1.8626 1.9196 1.3243 1.5920 1.3194 1.6478 1.6089 1.4306 1.5110 1.4799 1.4673 1.4824 2.0639 1.1891 1.2666 1.2061 1.0822 1.0839 1.0843 1.0797 1.0526 1.0904 1.0843 1.0664 1.0555 1.0640 7.7960 7.2381 1.0853 1.0619 1.0639 1.0597 1.0577 1.0372 1.0382 1.0777 1.0783 1.0789 1.0793 1.0984 1.0839 1.0985 1.1031 1.1026 1.0993 1.0979 1.0998 1.0987
irintensity: 8.3237 1.2945 0.9447 0.6418 0.4049 1.0298 1.1010 0.7431 1.3053 0.0751 1.8561 1.6500 1.3066 1.1120 3.2682 0.6406 5.2365 1.2151 4.7944 1.5625 0.1333 0.2545 2.7580 3.8425 0.7751 3.0976 6.7255 4.8119 4.1312 6.0156 2.2333 0.8716 4.8522 12.3939 2.5629 1.8959 2.6061 3.5810 7.9763 4.9506 11.1129 1.4906 5.6928 0.9624 2.4387 2.2911 3.3218 0.3384 2.9257 3.5745 3.0328 4.4734 6.2298 8.1548 0.2302 3.7354 2.7071 1.3327 1.9776 0.9087 1.5846 21.2009 6.9953 12.4517 3.3247 1.4787 5.1860 11.9976 3.2739 8.7051 3.2838 19.4706 8.4207 14.4347 172.0068 0.3185 91.5028 15.1264 74.2046 22.7052 22.1418 51.8587 33.1931 18.6861 9.8347 51.6495 53.1092 20.4984 48.6692 48.5133 59.4524 33.3645 12.0048 73.9436 35.0063 41.9684
temp: 298.150 k
press: 1.00000 atm
elementType: 8 6 6 6 6 6 6 6 6 6 6 6 6 6 1 1 1 1 1 1 1 1 1 1 1 1 1 1 1 1 1 1 1 1
symmnumber: 1
zpe: 783948.9 jmol-1
zpe.correction: 0.298590 hartree
zpe.thermalcorrener: 0.312719 hartree
zpe.thermalcorrenthalpy: 0.313664 hartree
zpe.thermalcorrgfe: 0.258209 hartree
zpe.sumelectzpe: -581.494902 hartree
zpe.sumelectthermal: -581.480773 hartree
zpe.sumelectthermalent: -581.479828 hartree
zpe.sumelectthermalfe: -581.535283 hartree
dipole: 3.1548 0.6441 -1.7112
dipole: 3.6463
quadrupole: -101.5441 -83.1281 -87.5003
quadrupole: -2.8720 8.3464 1.2110
quadrupole: -10.8199 7.5961 3.2238 -2.8720 8.3464 1.2110
hfenergy: -581.793492 hartree
pointgroup: C01 [X(C13H20O1)]
dipole: 1.2355794 -0.3139684 0.6578757 debye
polarizability: 150.9372837|2.3013123|139.329588|-0.0109118|4.0084105|114.7622388 unknown
InChI: InChI=1S/C13H20O/c1-13(2)7-3-4-11-6-5-10(9-14)8-12(11)13/h9-10H,3-8H2,1-2H3
charge 0 multiplicity 1
34 atoms
O  -3.885345 0.748485 -1.253439
C  1.636656 0.818389 0.187507
C  0.24762 0.159541 0.356754
C  0.021246 -1.165401 0.096546
C  2.745259 -0.26644 0.047812
C  -0.875547 1.078319 0.843904
C  1.098494 -2.115449 -0.412183
C  2.355869 -1.39036 -0.931321
C  -2.299766 0.52116 0.611017
C  -1.338481 -1.827889 0.294899
C  -2.353805 -0.966429 1.073379
C  1.640163 1.735813 -1.074661
C  1.980778 1.689985 1.431961
C  -2.700763 0.627772 -0.855456
H  2.936143 -0.713438 1.045272
H  3.686593 0.222928 -0.271494
H  -0.751309 1.270176 1.929492
H  -0.782781 2.071703 0.359487
H  1.378526 -2.810523 0.40962
H  0.667012 -2.758616 -1.207521
H  3.189994 -2.108037 -1.049486
H  2.15643 -0.96628 -1.934584
H  -3.044268 1.095765 1.195261
H  -1.753237 -2.104242 -0.698799
H  -1.191496 -2.792216 0.823979
H  -3.378416 -1.363376 0.952221
H  -2.113131 -0.988854 2.154094
H  2.609027 2.263955 -1.1604
H  1.482975 1.150644 -1.998123
H  0.846521 2.503665 -1.024429
H  3.011135 2.083053 1.339828
H  1.303722 2.556794 1.536222
H  1.925492 1.094165 2.36221
H  -1.854207 0.580638 -1.589573
