program: Gaussian 09
title: 000112047
version: EM64L-G09RevD.01
frameworkgroup: C1[X(C8H13NO)]
method: RPBEPBE
basis: SDD
operation: Freq
keyword: #p
keyword: freq=noraman
keyword: PBEPBE/SDD
title: #p freq=noraman PBEPBE/SDD
converged: NO YES NO NO
title: Mulliken charges:
elementType: O N C C C C C C C C H H H H H H H H H H H H H
charge: -0.254544 -0.345193 -0.125966 -0.195850 -0.442111 -0.440200 -0.424708 -0.378533 -0.404552 0.120658 0.233164 0.243134 0.204936 0.209416 0.235248 0.193995 0.227366 0.226224 0.186897 0.200678 0.215641 0.203126 0.311171
chargesum: 0.00000
title: Mulliken charges with hydrogens summed into heavy atoms:
elementType: O N C C C C C C C C
charge: -0.254544 -0.034022 0.107198 0.047284 -0.027758 -0.010957 0.028882 0.009042 0.014215 0.120658
polarizability: 9.14448655e+01 -3.52564666e+00 9.63965121e+01 -2.40616686e+00 -1.03796473e+00 7.46904864e+01
1716.lowfreq: -21.3140 -0.0009 -0.0006 0.0002 1.6053 16.9952 95.0303 135.8142 195.2083
frequency: 94.9711 135.7697 195.1994 245.3164 314.5408 331.3462 396.7880 440.6943 469.4227 523.2629 587.9882 599.0491 683.6371 725.1206 762.1782 778.8117 840.7781 855.4383 907.4757 914.8224 941.7588 982.8259 994.4511 1056.5858 1065.5617 1073.4546 1094.1106 1113.9886 1144.9235 1165.4789 1192.5279 1224.0911 1235.0368 1245.2680 1268.1172 1293.6063 1297.6332 1314.3509 1331.0159 1338.6458 1344.0147 1350.1116 1357.4577 1387.1619 1455.9826 1464.2348 1470.1201 1476.3139 1494.4564 1661.5651 2952.7404 2962.5057 2964.8841 2966.0118 2979.3854 2982.2300 3012.8972 3031.7350 3033.6005 3035.8262 3039.9256 3049.9103 3573.9668
redmass: 4.4169 2.8678 3.5335 2.4174 1.9786 1.8989 3.4626 3.1412 3.1156 1.5636 4.2077 1.5880 4.8596 4.3342 2.5559 2.0700 1.9478 2.6611 1.5553 2.0219 2.2539 1.7137 2.3157 2.1421 1.5791 1.6716 1.5317 1.1694 2.7896 1.2739 1.3042 1.5227 1.4974 1.9386 1.3405 1.5340 1.5762 1.3171 1.5286 1.4916 1.5035 1.4552 1.4896 1.9298 1.0847 1.0858 1.0855 1.0896 1.0909 8.3728 1.0788 1.0637 1.0628 1.0625 1.0605 1.0665 1.0908 1.0955 1.0993 1.0992 1.0991 1.1033 1.0788
irintensity: 2.1177 1.2211 1.2887 3.9732 3.0655 1.8612 1.1046 3.5123 9.2591 28.5059 4.8905 97.0459 9.1595 3.5262 1.7541 1.4875 6.6001 2.5795 5.8466 5.3715 6.4062 3.3956 1.9188 21.3629 0.3864 1.6946 1.3991 1.0271 4.2987 3.7402 3.3180 19.9839 11.3527 59.0636 0.0503 11.3521 1.4053 2.6235 2.7333 1.4158 1.6892 0.7131 0.6681 13.9527 13.0995 9.4477 13.6856 8.7951 8.1258 318.7323 26.5758 56.3313 37.6556 39.4005 28.8874 38.1691 15.5920 58.1799 51.1102 45.2197 37.7837 75.3832 23.5821
temp: 298.150 k
press: 1.00000 atm
elementType: 8 7 6 6 6 6 6 6 6 6 1 1 1 1 1 1 1 1 1 1 1 1 1
symmnumber: 1
zpe: 527691.2 jmol-1
zpe.correction: 0.200987 hartree
zpe.thermalcorrener: 0.209567 hartree
zpe.thermalcorrenthalpy: 0.210511 hartree
zpe.thermalcorrgfe: 0.167804 hartree
zpe.sumelectzpe: -441.865391 hartree
zpe.sumelectthermal: -441.856811 hartree
zpe.sumelectthermalent: -441.855867 hartree
zpe.sumelectthermalfe: -441.898575 hartree
dipole: -0.6098 -4.1202 1.1213
dipole: 4.3134
quadrupole: -58.5787 -66.1635 -59.1607
quadrupole: -8.0729 0.0309 2.8030
quadrupole: 2.7223 -4.8625 2.1403 -8.0729 0.0309 2.8030
hfenergy: -442.0663781 hartree
pointgroup: C01 [X(C8H13N1O1)]
dipole: -0.3252795 1.6101822 -0.4259192 debye
dipolederiv: -0.5672263 0.2318262 -0.1285225 0.0945633 -1.1014101 0.1295483 -0.1547408 0.2750268 -0.4572186 -0.5024707 -0.2596498 0.0514439 -0.0837038 -0.9909675 0.0490281 0.0387719 -0.1891541 -0.4339001 0.0364493 -0.0635126 -0.0012977 -0.1084532 0.0440792 -0.0781618 -0.0185543 -0.0641281 0.1414791 -0.1062437 0.0271038 -0.1690512 0.043732 -0.0077659 0.0648079 -0.2058679 0.0580634 -0.0346147 0.0359725 -0.0313885 0.041476 -0.0437197 0.0822703 -0.0329201 0.0064862 0.0137524 0.0776425 0.1207784 0.0410091 0.0627439 0.0365161 0.0268128 0.0090339 0.0402522 -0.0014195 0.1257094 0.1441564 -0.1834676 -0.0352505 -0.0764104 0.4230865 -0.1110615 -0.0850381 -0.1514861 0.3465714 0.0892469 -0.0156533 0.0204824 -0.0032875 0.0285681 -0.0156123 0.0625135 -0.0205659 0.1474774 0.076935 0.0021809 0.0383716 0.0024526 0.057616 -0.013028 0.0124901 -0.0165993 0.0856527 0.6459364 0.1325496 0.2789952 0.0301572 1.5856609 -0.1323626 0.4151836 -0.0826514 0.3911817 0.0106056 0.0622308 -0.0628757 0.0601732 0.0023173 0.0821593 -0.0417915 0.0910593 -0.1064975 -0.0376266 0.0129457 0.0948162 0.0168833 0.048659 -0.004256 0.0942151 -0.0327311 -0.1004738 0.0246868 0.0374622 0.0222038 0.0502539 -0.2167292 -0.0337353 0.0208203 -0.0071033 0.0661418 -0.0049307 -0.012531 -0.1000686 0.0159909 0.0604965 0.0660468 -0.0716129 0.0259352 -0.10071 0.0545463 0.0773241 0.0315311 0.0299651 -0.1236127 -0.0437129 0.0385293 0.0134101 0.0779092 -0.0552918 -0.0326854 -0.1073459 -0.0002777 0.0842703 0.0448208 -0.0856726 -0.0099651 -0.136468 -0.0592413 -0.0348212 0.1037083 -0.0134151 -0.0291895 0.0579006 0.1218602 0.1620161 -0.1072013 0.0868886 0.0431695 0.0047827 0.005275 -0.1300278 -0.0661511 -0.0198933 -0.1302377 -0.0239045 0.0000465 0.012147 -0.0857665 0.012918 0.0141489 0.04086 -0.1616725 0.063372 -0.1147839 -0.0903716 0.0351678 0.1252798 0.0298603 0.0319244 -0.0434869 0.1711004 -0.0552593 -0.0721381 0.0300993 0.0626903 -0.1035407 0.0365106 0.0427676 0.007308 -0.0665031 0.029915 -0.1144293 -0.1320583 -0.1468343 0.0241025 -0.132365 -0.0595719 -0.0044775 0.0079756 -0.0138878 0.0749586 0.199113 0.0027369 -0.1062182 -0.0036192 0.1265968 0.0274523 -0.1188512 0.0426387 0.2676161 unknown
polarizability: 91.0806773|3.219935|96.771921|2.503064|-0.6929284|74.6792657 unknown
InChI: InChI=1S/C8H13NO/c10-8-7-4-2-1-3-6(7)5-9-8/h6-7,9H,1-5H2
charge 0 multiplicity 1
23 atoms
O  1.673544 -1.823071 0.56964
N  1.936746 0.522928 0.445823
C  -0.084664 1.144784 -0.61566
C  0.202929 -0.366722 -0.876058
C  -1.099134 1.36254 0.53823
C  -1.00032 -1.328381 -0.797575
C  1.323816 1.690288 -0.219082
C  -2.347758 0.460271 0.414693
C  -1.93274 -1.028963 0.398031
C  1.333701 -0.688494 0.132185
H  -0.455601 1.640414 -1.531692
H  0.667489 -0.469903 -1.880876
H  -1.388108 2.431457 0.568685
H  -0.598566 1.137144 1.50268
H  -0.610044 -2.361609 -0.730949
H  -1.582702 -1.25251 -1.737604
H  1.907128 1.999998 -1.110515
H  1.253204 2.554167 0.467522
H  -2.898885 0.70209 -0.5183
H  -3.038433 0.659995 1.256285
H  -1.413327 -1.276784 1.34539
H  -2.825999 -1.680089 0.342436
H  2.758625 0.57335 1.047815
