program: Gaussian 09
title: 000112315
version: EM64L-G09RevD.01
frameworkgroup: C1[X(C20H18N2O2)]
method: RPBEPBE
basis: SDD
operation: Freq
keyword: #p
keyword: freq=noraman
keyword: PBEPBE/SDD
title: #p freq=noraman PBEPBE/SDD
converged: NO YES NO NO
title: Mulliken charges:
elementType: O O N N C C C C C C C C C C C C C C C C C C C C H H H H H H H H H H H H H H H H H H
charge: -0.260386 -0.260391 -0.055943 -0.055936 0.018715 0.018717 0.347467 0.347464 0.047065 0.047066 0.496231 0.496231 -0.482111 -0.482110 -0.566352 -0.566352 0.207481 0.207474 -0.808123 -0.808124 -0.325181 -0.325175 -0.820983 -0.820983 0.235938 0.235938 0.260804 0.260804 0.234539 0.234311 0.254061 0.234529 0.254061 0.234320 0.292526 0.292528 0.230539 0.230536 0.228863 0.228863 0.230559 0.230517
chargesum: 0.00000
title: Mulliken charges with hydrogens summed into heavy atoms:
elementType: O O N N C C C C C C C C C C C C C C C C C C C C
charge: -0.260386 -0.260391 -0.055943 -0.055936 0.018715 0.018717 0.347467 0.347464 0.047065 0.047066 0.496231 0.496231 -0.246173 -0.246172 -0.305548 -0.305547 0.207481 0.207474 -0.085212 -0.085213 -0.032655 -0.032647 -0.131045 -0.131045
polarizability: 6.65570100e+02 7.56685652e+00 2.37516477e+02 7.53973885e-03 3.83991396e-03 1.10561624e+02
1716.lowfreq: -76.4491 -76.4265 -6.0669 -0.0010 0.0003 0.0009 4.0115 4.4196 22.9247
frequency: -76.4429 -76.4246 22.9247 26.9049 31.1349 55.8827 56.7971 71.0219 109.4438 141.5528 146.1073 151.2698 177.8931 186.8678 223.7679 225.0447 242.0196 266.6939 268.2988 282.0174 313.7691 322.3806 377.0712 401.2534 418.9207 435.9752 468.4808 488.7467 524.4324 526.0011 528.0800 561.2580 561.9600 591.1376 593.2681 608.4673 621.9130 650.0083 697.9549 729.9639 753.4591 753.8968 785.6034 808.6810 812.1057 851.7198 866.9351 866.9898 885.0513 898.1556 898.2993 914.7086 944.1844 954.4058 977.2801 977.4133 981.5583 1022.7813 1022.8393 1042.5386 1042.5470 1047.4299 1052.0431 1052.0874 1060.3091 1097.7088 1114.5400 1133.0217 1137.7614 1183.1157 1189.5302 1252.4949 1252.5446 1279.5299 1302.2415 1302.6302 1317.6847 1374.9006 1375.9233 1398.4158 1398.6590 1402.0070 1402.0484 1408.0988 1410.6512 1458.4355 1459.5645 1471.3662 1471.3754 1473.0556 1474.2208 1477.1683 1477.2006 1492.2733 1492.3789 1495.0600 1545.3416 1614.3146 1620.3431 1623.3622 1627.8109 1643.0189 2977.4390 2977.5035 2986.0556 2986.1189 3055.1893 3055.1952 3064.0648 3064.0766 3087.7654 3087.7680 3102.9953 3102.9961 3114.4847 3114.5128 3153.7515 3162.8828 3163.8023 3163.8337
redmass: 1.0222 1.0227 4.0546 5.2050 4.9822 1.0807 1.0367 4.9188 5.5591 4.2805 3.6552 4.6885 4.1734 3.3594 4.3084 3.3030 3.2281 2.9247 2.8567 3.4069 4.9825 4.1570 4.7145 6.9113 4.4191 5.1331 5.0927 5.4710 3.5286 5.0696 3.5845 5.4353 4.8039 3.2346 3.2042 4.5309 5.2663 7.0348 11.2727 7.5384 4.7029 4.6886 6.0214 7.3243 6.6716 13.6833 1.3701 1.3692 1.9496 1.3770 1.3831 5.3335 3.2034 3.8668 1.8821 1.8157 1.0888 1.4879 1.4736 1.4878 1.4876 5.8760 1.5533 1.5532 3.4612 3.4576 2.8661 2.7941 2.5543 2.0874 3.1657 1.4149 1.4025 1.4516 4.5702 5.7877 2.3984 4.1086 3.9682 1.3759 1.3296 1.2620 1.2677 3.2898 3.5484 1.8169 1.7790 1.0454 1.0454 1.1581 1.1166 1.0453 1.0453 1.7155 1.7041 5.6983 9.6779 6.5792 7.3615 7.6147 7.9910 6.9099 1.0375 1.0375 1.0377 1.0377 1.0978 1.0978 1.0980 1.0980 1.0986 1.0986 1.0986 1.0986 1.0911 1.0911 1.0963 1.0867 1.0932 1.0933
irintensity: 0.1409 0.3121 0.5610 1.4388 0.6084 0.0000 0.7782 0.0000 0.0000 3.2381 0.0000 0.0000 3.8492 0.0000 0.9415 2.4242 0.0000 3.4396 0.0000 0.0000 1.3122 0.0000 0.0000 0.7548 12.0046 14.2139 0.0000 0.0000 0.0000 4.7413 0.0277 0.9722 0.0000 0.0000 13.6527 22.6300 0.0000 0.0000 8.9239 4.4900 5.1555 0.0000 0.0000 0.0000 31.4445 104.6126 0.0016 62.1791 0.0000 3.9075 0.0000 0.0000 3.2151 0.0000 9.4270 0.0000 61.5347 11.6168 0.0003 0.0027 2.2313 0.0000 0.0006 35.2428 84.0748 0.0000 11.9414 7.0466 0.0000 18.7580 0.0000 0.0000 14.0917 0.0000 5.8207 0.0000 88.2500 0.0000 26.6519 0.0000 44.1305 0.0000 26.3776 0.0000 26.9872 0.0000 7.6393 0.0033 29.4533 0.0000 15.2762 0.0000 27.5032 0.0008 35.8033 0.0000 116.4697 0.0000 13.8305 0.0000 29.4473 0.0000 100.6538 0.0122 66.0661 0.0111 0.4379 39.7823 0.3170 34.3393 24.4640 6.4487 14.2033 0.0149 43.8544 0.0011 0.0000 14.1329 13.4537 0.0757
temp: 298.150 k
press: 1.00000 atm
elementType: 8 8 7 7 6 6 6 6 6 6 6 6 6 6 6 6 6 6 6 6 6 6 6 6 1 1 1 1 1 1 1 1 1 1 1 1 1 1 1 1 1 1
symmnumber: 1
zpe: 858021.2 jmol-1
zpe.correction: 0.326803 hartree
zpe.thermalcorrener: 0.347547 hartree
zpe.thermalcorrenthalpy: 0.348492 hartree
zpe.thermalcorrgfe: 0.275153 hartree
zpe.sumelectzpe: -1031.204032 hartree
zpe.sumelectthermal: -1031.183287 hartree
zpe.sumelectthermalent: -1031.182343 hartree
zpe.sumelectthermalfe: -1031.255682 hartree
dipole: 0.0001 0.0000 0.0002
dipole: 0.0002
quadrupole: -85.8174 -132.2068 -144.4657
quadrupole: -5.3512 0.0100 0.0060
quadrupole: 35.0126 -11.3769 -23.6357 -5.3512 0.0100 0.0060
hfenergy: -1031.5308345 hartree
pointgroup: C01 [X(C20H18N2O2)]
dipole: 0.0000264 0.0000062 -0.0000595 debye
polarizability: 665.5161503|-8.9506847|237.5396208|-0.597077|-1.9463109|110.5924293 unknown
InChI: InChI=1S/C20H18N2O2/c1-11-7-13(3)19-15(9-11)21-17(23-19)5-6-18-22-16-10-12(2)8-14(4)20(16)24-18/h5-10H,1-4H3
charge 0 multiplicity 1
42 atoms
O  2.799794 1.288674 -0.011254
O  -2.800332 -1.279882 0.034821
N  2.51466 -1.020792 0.025188
N  -2.515234 1.029592 -0.001645
C  4.078268 0.688721 -0.00365
C  -4.078807 -0.679948 0.027207
C  5.330708 1.323954 -0.015618
C  -5.331241 -1.315196 0.039199
C  3.896616 -0.72574 0.018719
C  -3.897184 0.734517 0.004822
C  6.302279 -0.991889 0.0189
C  -6.302849 1.000632 0.00464
C  6.433197 0.433047 -0.00365
C  -6.433744 -0.424306 0.027225
C  5.01807 -1.582948 0.030291
C  -5.018649 1.591709 -0.00675
C  1.89484 0.16151 0.007435
C  -1.895386 -0.152689 0.016115
C  5.486184 2.831807 -0.039205
C  -5.486697 -2.82305 0.062861
C  0.491902 0.483926 0.003965
C  -0.492448 -0.4751 0.019585
C  7.553351 -1.855162 0.029807
C  -7.553935 1.863883 -0.006399
H  7.44379 0.862643 -0.012288
H  -7.44433 -0.853918 0.035888
H  4.888624 -2.668907 0.04726
H  -4.889216 2.677669 -0.02372
H  6.04232 3.187419 0.84772
H  6.048487 3.159003 -0.933109
H  4.50551 3.333922 -0.050464
H  -6.043205 -3.178673 -0.823825
H  -4.506015 -3.325158 0.073723
H  -6.04862 -3.150242 0.957006
H  0.226784 1.546337 -0.011975
H  -0.22733 -1.537511 0.035528
H  8.177432 -1.669165 -0.864532
H  8.18122 -1.641598 0.915306
H  7.301957 -2.929089 0.04698
H  -7.302557 2.937832 -0.022368
H  -8.181101 1.651155 -0.892603
H  -8.178715 1.67701 0.887263
