program: Gaussian 09
title: 000112114
version: EM64L-G09RevD.01
frameworkgroup: C1[X(C10H13NO3)]
method: RPBEPBE
basis: SDD
operation: Freq
keyword: #p
keyword: freq=noraman
keyword: PBEPBE/SDD
title: #p freq=noraman PBEPBE/SDD
converged: YES YES NO NO
title: Mulliken charges:
elementType: O O O N C C C C C C C C C C H H H H H H H H H H H H H
charge: -0.294315 -0.413878 -0.228096 -0.607735 -0.162468 -0.257187 -0.349411 0.396682 -0.394221 -0.398241 0.145956 -0.224146 -0.216425 -0.240703 0.259105 0.220109 0.192598 0.205242 0.208184 0.226523 0.268997 0.300277 0.300359 0.225769 0.226246 0.228102 0.382679
chargesum: 0.00000
title: Mulliken charges with hydrogens summed into heavy atoms:
elementType: O O O N C C C C C C C C C C
charge: -0.294315 -0.031199 -0.228096 -0.007099 0.096637 0.155519 0.064015 0.396682 -0.167698 -0.129244 0.145956 0.001623 0.009821 -0.012601
polarizability: 1.69098649e+02 7.28538875e+00 1.09346746e+02 -2.72717157e+00 9.18448302e+00 8.60742769e+01
1716.lowfreq: -12.8023 -3.0372 -0.0004 0.0004 0.0006 1.8191 19.3793 26.3942 52.1650
frequency: 14.3599 26.2820 52.1636 59.5194 83.8353 127.3222 139.9981 200.3590 229.0754 271.5879 307.3213 317.1497 375.5444 402.4101 427.1415 465.5150 516.7631 549.1795 571.9631 597.6686 611.9779 616.5056 693.0715 702.5660 739.4600 807.1056 829.2055 855.9955 909.9462 924.8366 945.1153 979.4317 989.6438 995.2817 1014.5487 1026.3446 1040.0890 1049.1201 1061.4370 1086.6488 1140.7413 1171.6579 1172.1696 1184.7571 1203.6585 1218.1844 1232.2105 1251.6052 1301.2773 1314.1347 1334.8005 1372.9611 1381.3755 1395.4111 1439.3417 1461.0957 1479.0788 1485.9599 1595.0346 1603.2303 1618.2617 1671.5602 2908.6025 2930.5381 2954.6475 2986.0946 3006.8211 3112.0906 3127.2590 3140.8075 3158.4782 3173.2904 3491.1475 3517.2481 3633.3680
redmass: 4.1522 5.2769 6.9977 4.8893 3.7124 3.2751 5.4432 3.6113 3.7295 2.1668 1.7422 3.1742 2.8616 2.8383 5.0332 2.9841 2.7174 1.5561 2.6926 3.0530 1.7630 6.1008 3.7190 2.2704 1.3933 4.0357 3.5225 1.2503 1.3316 2.0075 6.3552 1.3802 6.1162 1.3621 1.7792 2.2356 2.9938 2.9620 3.8074 1.7729 1.2759 1.1324 1.3004 1.1115 1.2101 2.1268 1.5775 1.5689 1.4443 1.3445 1.2346 2.2139 2.0725 2.3487 2.1129 1.0925 1.1439 2.0961 6.0438 1.2374 6.0480 4.6707 1.0566 1.0553 1.1024 1.0884 1.1010 1.0874 1.0868 1.0930 1.0978 1.0971 1.0442 1.0641 1.1003
irintensity: 1.0818 0.0201 0.2252 0.5077 1.6038 12.5025 0.3384 3.4375 1.4922 28.4785 17.5845 5.2374 15.2587 0.4617 9.9877 4.7306 50.3130 138.4837 105.4093 82.5556 106.9122 3.5859 54.4792 29.2070 83.1961 1.0326 0.3561 0.1371 1.4894 3.8028 11.8037 0.0686 0.2056 0.5270 1.8110 33.9694 70.8944 299.0374 106.6431 30.9489 23.4962 3.3802 5.7968 1.2325 4.5889 2.9172 4.3640 7.2886 8.8965 27.2445 18.7529 7.4380 18.9230 2.4627 12.7959 11.6876 11.7184 10.4977 2.9050 150.5791 7.0509 171.3787 35.9017 67.6654 44.9731 2.1327 68.5102 10.1940 1.1821 31.7321 31.4468 8.0619 5.3882 29.2274 26.4274
temp: 298.150 k
press: 1.00000 atm
elementType: 8 8 8 7 6 6 6 6 6 6 6 6 6 6 1 1 1 1 1 1 1 1 1 1 1 1 1
symmnumber: 1
zpe: 566924.6 jmol-1
zpe.correction: 0.215930 hartree
zpe.thermalcorrener: 0.230090 hartree
zpe.thermalcorrenthalpy: 0.231034 hartree
zpe.thermalcorrgfe: 0.171989 hartree
zpe.sumelectzpe: -668.211771 hartree
zpe.sumelectthermal: -668.197612 hartree
zpe.sumelectthermalent: -668.196668 hartree
zpe.sumelectthermalfe: -668.255713 hartree
dipole: 0.9185 -2.8931 0.4783
dipole: 3.0728
quadrupole: -79.4178 -79.2495 -83.9111
quadrupole: 8.2536 -8.3700 2.6749
quadrupole: 1.4417 1.6099 -3.0516 8.2536 -8.3700 2.6749
hfenergy: -668.4277015 hartree
pointgroup: C01 [X(C10H13N1O3)]
dipole: -0.4206875 0.4996939 1.0172937 debye
polarizability: 166.2197202|-6.1189866|101.7998545|16.3281896|12.9808565|96.5000978 unknown
InChI: InChI=1S/C10H13NO3/c11-9(10(12)13)7-14-6-8-4-2-1-3-5-8/h1-5,9,12H,6-7,11H2
charge 0 multiplicity 1
27 atoms
O  0.475102 0.169593 0.207227
O  4.301006 -0.995533 1.712474
O  5.127764 0.305246 -0.026858
N  2.776821 -0.045078 -1.477076
C  2.773336 -0.453415 -0.077929
C  1.792511 0.361862 0.819028
C  -0.571362 0.953755 0.869556
C  -1.913728 0.657947 0.223525
C  -2.995459 1.551908 0.425244
C  -2.116317 -0.510065 -0.550084
C  4.181408 -0.327308 0.488707
C  -4.264971 1.278507 -0.129959
C  -3.385672 -0.779922 -1.111388
C  -4.464329 0.109526 -0.901267
H  2.466093 -1.513678 0.020321
H  1.798616 -0.019404 1.861905
H  2.068259 1.440029 0.812182
H  -0.336203 2.038978 0.796693
H  -0.597031 0.689514 1.95195
H  -2.846811 2.465947 1.014876
H  -1.274794 -1.189631 -0.711806
H  3.504051 0.628976 -1.727825
H  1.846189 0.13974 -1.854933
H  -5.09331 1.977334 0.032583
H  -3.531612 -1.684512 -1.712744
H  -5.44751 -0.102111 -1.336388
H  5.225653 -0.880904 2.06319
