program: Gaussian 09
title: 000112128
version: EM64L-G09RevD.01
frameworkgroup: C1[X(C12H25N3)]
method: RPBEPBE
basis: SDD
operation: Freq
keyword: #pfreq=noraman
keyword: PBEPBE/SDD
title: #p freq=noraman PBEPBE/SDD
converged: YES YES NO NO
title: Mulliken charges:
elementType: N N N C C C C C C C C C C C C H H H H H H H H H H H H H H H H H H H H H H H H H
charge: -0.282154 -0.551615 -0.020748 0.341396 -0.453632 -0.443426 0.004274 -0.739906 -0.759436 -0.410316 -0.471096 -0.755158 -0.349761 -0.435735 -0.149399 0.192264 0.200315 0.219987 0.186806 0.184167 0.210727 0.212941 0.210438 0.210465 0.213996 0.220658 0.192991 0.236023 0.208536 0.225212 0.213449 0.223525 0.201844 0.241477 0.258011 0.271386 0.228035 0.207053 0.267916 0.238492
chargesum: 0.00000
title: Mulliken charges with hydrogens summed into heavy atoms:
elementType: N N N C C C C C C C C C C C C
charge: -0.040677 -0.022218 -0.020748 0.341396 -0.061054 -0.036633 0.188441 -0.105800 -0.114317 0.018698 -0.037349 -0.116341 0.085327 0.070673 -0.149399
polarizability: 1.81400801e+02 -4.48121477e+00 1.42696484e+02 6.80435818e+00 9.92372300e-01 1.24663565e+02
1716.lowfreq: -14.7202 -4.0845 -0.0007 -0.0007 -0.0004 7.6829 13.5295 32.1589 41.5403
frequency: 12.5429 31.8583 41.4485 52.6651 68.1074 96.2494 104.1252 126.7988 151.0889 162.5927 191.9918 195.1097 213.8182 229.3956 247.6809 255.7953 263.7791 278.7909 300.8373 309.5791 358.4355 375.4513 389.3777 394.0651 423.5112 472.8532 491.1389 509.3982 536.6711 590.7496 686.3061 750.4973 779.8678 789.8086 818.5097 841.1294 876.0154 892.0010 928.5616 930.3709 934.7747 960.6579 988.0637 1005.8931 1012.2262 1020.2571 1036.9340 1063.2893 1072.6525 1094.5407 1097.3735 1110.0444 1141.5825 1147.6085 1153.8581 1195.0798 1207.9131 1214.5108 1245.1285 1257.2745 1274.7821 1281.2306 1289.3348 1294.4249 1307.3571 1319.3915 1326.1788 1334.7438 1349.5635 1352.3042 1373.5183 1383.3791 1387.6392 1393.7205 1447.4533 1450.8093 1453.4390 1459.2877 1464.5899 1469.1512 1470.3503 1474.3555 1480.0997 1482.1459 1487.7375 1492.1377 1500.2534 1643.9164 2198.8524 2869.8983 2891.9543 2948.6612 2957.0501 2963.2722 2963.8240 2965.2437 2970.0465 2974.4919 2995.1208 3004.7211 3008.4193 3029.1298 3031.1471 3034.0782 3055.9183 3059.9791 3062.0378 3062.6542 3065.6782 3066.6240 3067.2755 3409.8524 3462.7011 3590.9801
redmass: 4.3044 3.8355 2.7744 3.4341 3.5119 2.1959 2.7837 2.5022 4.1235 2.3449 2.9800 1.9598 1.1301 1.0446 2.4285 1.3813 1.2686 1.9891 2.4016 3.0232 2.1223 3.4983 2.5027 2.3845 2.4706 2.5758 2.7999 1.8984 4.3146 1.8547 1.3122 2.9745 1.2017 1.2482 1.6737 1.7217 1.7768 2.0474 1.7133 3.7580 1.6995 1.7676 1.3795 1.3922 2.1773 1.5095 3.0225 1.7461 2.7080 4.0681 1.9338 1.9802 3.9920 1.4867 1.5663 1.9758 2.0468 1.7094 1.4275 1.4935 1.3577 1.1454 1.2893 1.2041 1.4070 1.4336 1.3005 1.2557 1.4072 1.3716 1.2067 1.2190 1.3325 1.2619 1.0888 1.1051 1.1572 1.0667 1.0769 1.0602 1.0613 1.0518 1.0551 1.0545 1.0829 1.0641 1.0787 1.0915 12.4315 1.0706 1.0712 1.0640 1.0769 1.0450 1.0450 1.0400 1.0390 1.0606 1.0612 1.0993 1.0876 1.1023 1.0882 1.0989 1.0988 1.0999 1.0996 1.1000 1.0988 1.0981 1.0986 1.0740 1.0447 1.0976
irintensity: 0.1918 2.1718 3.1329 0.8780 1.9394 2.4073 1.7717 5.8647 3.8482 0.5480 1.2838 3.4370 0.1574 15.3449 1.9052 7.0458 21.5395 5.5143 4.4010 2.1257 0.6146 0.8025 5.2076 5.8095 10.1821 1.4131 8.3659 80.0296 8.1154 243.6115 88.2175 1.8827 0.8979 6.2799 5.2475 17.4060 0.6330 2.7359 3.2543 0.7873 1.3086 10.5895 3.5654 3.9175 1.5322 7.2482 1.6424 1.4804 2.9810 24.5093 0.0927 0.8942 66.5236 25.1690 1.7429 1.1081 4.1185 9.0044 10.2799 6.3481 3.7756 0.3525 1.7976 4.3869 1.0072 1.0020 2.2103 5.1815 17.0701 15.8401 21.3095 16.4499 3.4583 11.8476 10.3888 7.9722 10.7317 7.1657 8.4351 1.1498 5.3877 10.9765 7.3009 17.0656 3.3296 31.0448 5.0595 35.9053 16.8258 79.6635 90.3424 11.3306 26.0311 60.9886 48.1945 11.9216 24.2891 55.6485 8.0730 39.9332 6.4833 87.4531 12.5607 35.6514 42.2531 0.8628 35.6565 15.4735 104.9999 37.7424 59.1413 2.1014 0.9368 0.3905
temp: 298.150 k
press: 1.00000 atm
elementType: 7 7 7 6 6 6 6 6 6 6 6 6 6 6 6 1 1 1 1 1 1 1 1 1 1 1 1 1 1 1 1 1 1 1 1 1 1 1 1 1
symmnumber: 1
zpe: 934771.2 jmol-1
zpe.correction: 0.356036 hartree
zpe.thermalcorrener: 0.375605 hartree
zpe.thermalcorrenthalpy: 0.376549 hartree
zpe.thermalcorrgfe: 0.306436 hartree
zpe.sumelectzpe: -635.252067 hartree
zpe.sumelectthermal: -635.232497 hartree
zpe.sumelectthermalent: -635.231553 hartree
zpe.sumelectthermalfe: -635.301666 hartree
dipole: 5.5424 -0.6404 1.6446
dipole: 5.8166
quadrupole: -132.2393 -97.8770 -94.4045
quadrupole: 7.1700 -8.5509 4.5625
quadrupole: -24.0657 10.2966 13.7691 7.1700 -8.5509 4.5625
hfenergy: -635.6081021 hartree
pointgroup: C01 [X(C12H25N3)]
dipole: -2.1078658 -0.5261124 -0.7190204 debye
polarizability: 179.3435063|8.8316579|143.3338648|9.2578216|-2.3587889|126.0834791 unknown
InChI: InChI=1S/C12H25N3/c1-11(10-14)9-12(2,3)5-8-15-7-4-6-13/h11,15H,4-5,7-10,14H2,1-3H3
charge 0 multiplicity 1
40 atoms
N  1.777735 -0.242484 -0.40346
N  -2.182025 3.069876 -0.975826
N  6.280114 1.266431 0.883685
C  -1.826011 -1.684257 0.055832
C  -2.596945 -0.471044 0.681295
C  -0.480068 -1.254346 -0.609335
C  -2.974349 0.706929 -0.272388
C  -2.707755 -2.363039 -1.028921
C  -1.562102 -2.722446 1.181537
C  0.630337 -0.793256 0.357536
C  -2.031775 1.935233 -0.047621
C  -4.456442 1.11459 -0.100037
C  2.918593 0.188731 0.425613
C  4.123781 0.522655 -0.495101
C  5.317964 0.937533 0.258753
H  -2.003532 -0.07001 1.530513
H  -3.52281 -0.880628 1.134321
H  -0.082063 -2.099776 -1.204448
H  -0.689223 -0.440645 -1.335873
H  -2.836325 0.381983 -1.325937
H  -3.69027 -2.65459 -0.611376
H  -2.217163 -3.277001 -1.413645
H  -2.890787 -1.695734 -1.891502
H  -2.517648 -3.110661 1.58211
H  -0.98035 -3.582905 0.799635
H  -1.002734 -2.279196 2.026028
H  0.221082 -0.060935 1.096864
H  1.00086 -1.657796 0.940138
H  -2.189548 2.316595 0.981474
H  -0.978446 1.595323 -0.092185
H  -4.65971 1.420585 0.945083
H  -5.130609 0.271965 -0.340165
H  -4.728343 1.958478 -0.762602
H  1.469987 0.506007 -1.042882
H  -2.012093 2.840989 -1.960105
H  -3.038486 3.616259 -0.851738
H  3.196313 -0.647564 1.093529
H  2.698682 1.067116 1.07919
H  4.359511 -0.367443 -1.106921
H  3.848653 1.335073 -1.19637
