program: Gaussian 09
title: 000110981
version: EM64L-G09RevD.01
frameworkgroup: C1[X(C14H22O)]
method: RPBEPBE
basis: SDD
operation: Freq
keyword: #pfreq=noraman
keyword: PBEPBE/SDD
title: #p freq=noraman PBEPBE/SDD
converged: YES YES NO NO
title: Mulliken charges:
elementType: O C C C C C C C C C C C C C C H H H H H H H H H H H H H H H H H H H H H H
charge: -0.227158 0.360662 -0.316884 -0.460521 -0.420972 0.536605 -0.587279 -0.783552 -0.750338 -0.245886 -0.774312 0.198020 -0.789793 0.120065 -0.795893 0.215479 0.212582 0.195109 0.220158 0.207340 0.221113 0.203582 0.217278 0.236406 0.218879 0.212590 0.229885 0.207654 0.254697 0.229671 0.220505 0.254153 0.241172 0.209637 0.259377 0.234261 0.235712
chargesum: 0.00000
title: Mulliken charges with hydrogens summed into heavy atoms:
elementType: O C C C C C C C C C C C C C C
charge: -0.227158 0.360662 -0.101406 -0.052830 0.006526 0.536605 -0.162585 -0.110990 -0.100210 0.008811 -0.324136 0.198020 -0.084832 0.120065 -0.066543
polarizability: 1.94296891e+02 1.94806906e-01 1.40392867e+02 -3.66601394e+00 8.41987730e+00 1.29989732e+02
1716.lowfreq: -18.8681 -0.0010 -0.0009 -0.0007 4.6762 14.5723 29.1665 45.5972 57.3551
frequency: 28.5965 45.1814 57.2788 68.1992 78.5609 116.9104 129.7798 139.3408 179.5991 202.7151 235.5973 256.1874 271.7982 284.0208 302.4551 318.1817 348.1943 375.4007 410.4621 418.2149 429.9105 469.9552 478.0059 508.8449 545.3157 580.4678 594.5260 602.4580 696.8341 729.7912 766.4636 815.0583 851.2454 863.1633 884.9701 912.8729 924.2980 930.9533 933.4156 937.7073 968.6952 985.1245 986.9539 999.2909 1019.8326 1034.0026 1049.8548 1076.4270 1093.9016 1107.3264 1137.9795 1143.5476 1178.0710 1203.0773 1214.2114 1232.1470 1257.8069 1265.5234 1294.5426 1311.9295 1318.2777 1334.3144 1344.3479 1361.0775 1376.0057 1380.3142 1392.5844 1403.0778 1430.2625 1450.5160 1453.0172 1453.7601 1459.2667 1463.2151 1464.8205 1465.3051 1473.3611 1477.0889 1479.7661 1494.6182 1577.7551 1648.0427 1659.0338 2947.8237 2954.5835 2961.7893 2968.2001 2976.1356 2986.7284 2987.5714 2991.1230 3017.9343 3037.3071 3047.6580 3059.7048 3064.1907 3070.1251 3073.3552 3073.4564 3076.2048 3091.3603 3106.6003 3109.1209 3121.2095 3190.9174
redmass: 3.4653 1.7514 3.2017 1.9746 2.7614 2.8220 2.8766 1.0318 1.6748 1.7671 1.0685 2.6896 2.3081 2.5841 2.7636 2.9065 3.3899 2.4609 2.5752 2.4503 2.3721 3.0208 3.0467 2.5215 2.5784 3.7738 3.0467 2.4438 1.3434 2.4265 2.3526 2.2150 1.5006 2.3107 2.5812 1.6312 1.9979 2.0131 1.4546 1.3887 1.9033 1.7393 1.6629 1.4314 1.5379 1.6238 1.6328 1.7013 1.9758 1.3932 2.5022 2.4272 1.4748 2.4863 1.6856 1.5865 1.4457 2.3735 1.6759 1.8000 1.6925 1.4233 1.4927 1.3024 1.2249 1.4354 1.2042 1.2956 1.1689 1.0930 1.0758 1.0663 1.0859 1.0672 1.0546 1.0654 1.0631 1.0693 1.0578 1.0595 7.1951 6.7503 5.3028 1.0662 1.0622 1.0777 1.0363 1.0368 1.0370 1.0625 1.0389 1.0977 1.0951 1.1023 1.0991 1.0989 1.0943 1.0975 1.0986 1.0991 1.0628 1.0937 1.0925 1.0990 1.1131
irintensity: 1.3340 0.0485 0.3728 1.8541 2.7775 0.4658 1.5307 0.4929 1.2311 0.1988 0.1008 0.4959 0.9500 0.5066 0.9830 1.3189 1.7799 0.5684 1.7657 1.9855 0.0347 2.4076 2.4473 0.8643 5.2224 9.4436 4.5852 4.0704 0.0434 1.6826 0.8639 3.1671 4.2653 3.0993 2.3418 21.6891 18.7831 2.2986 5.4906 39.7735 11.4681 15.4487 11.9723 7.3569 1.2742 7.5794 0.0912 3.4965 21.4806 6.0671 3.7673 7.1746 16.2127 1.9501 2.7039 48.3654 3.9612 112.7203 1.4641 10.3856 1.1433 1.8225 0.6453 24.7833 34.4994 21.4737 17.7160 32.4077 6.8102 32.8745 1.0732 22.8397 4.4243 6.3710 13.6127 12.4044 4.1345 16.1794 11.1765 6.6879 176.8282 36.8238 25.9008 20.4279 20.0396 33.1832 40.9227 18.7208 4.6781 36.4160 17.1455 45.5063 52.6766 43.1885 39.8518 31.8702 11.6135 13.3037 54.1971 29.6936 6.8805 4.6965 26.2858 14.0857 26.4487
temp: 298.150 k
press: 1.00000 atm
elementType: 8 6 6 6 6 6 6 6 6 6 6 6 6 6 6 1 1 1 1 1 1 1 1 1 1 1 1 1 1 1 1 1 1 1 1 1 1
symmnumber: 1
zpe: 846693.5 jmol-1
zpe.correction: 0.322489 hartree
zpe.thermalcorrener: 0.339731 hartree
zpe.thermalcorrenthalpy: 0.340675 hartree
zpe.thermalcorrgfe: 0.277404 hartree
zpe.sumelectzpe: -620.707943 hartree
zpe.sumelectthermal: -620.690701 hartree
zpe.sumelectthermalent: -620.689757 hartree
zpe.sumelectthermalfe: -620.753028 hartree
dipole: -4.1538 -0.1287 1.0783
dipole: 4.2934
quadrupole: -109.8103 -92.7038 -90.6402
quadrupole: 2.1105 6.9435 1.0163
quadrupole: -12.0922 5.0143 7.0779 2.1105 6.9435 1.0163
hfenergy: -621.0304318 hartree
pointgroup: C01 [X(C14H22O1)]
dipole: 1.6408096 -0.128615 -0.3800669 debye
polarizability: 194.3984286|-1.0610297|137.6544548|-2.4881017|-9.5803344|132.6266054 unknown
InChI: InChI=1S/C14H22O/c1-10-7-6-8-14(4,5)13(10)9-11(2)12(3)15/h9,13H,1,6-8H2,2-5H3
charge 0 multiplicity 1
37 atoms
O  -4.358425 -0.06073 0.357274
C  1.416242 -1.166244 -0.132416
C  0.624692 0.139651 0.336715
C  2.850529 -1.110643 0.477539
C  3.635711 0.16415 0.107201
C  1.419825 1.41489 0.005151
C  2.846709 1.4261 0.537541
C  1.492525 -1.249594 -1.680542
C  0.70092 -2.427008 0.414984
C  -0.779217 0.163021 -0.218001
C  0.903274 2.478145 -0.66574
C  -1.961154 0.043572 0.466722
C  -2.089545 -0.119729 1.968957
C  -3.267726 0.064248 -0.279513
C  -3.293408 0.237541 -1.800774
H  0.58627 0.068089 1.444616
H  3.407709 -2.012067 0.152507
H  2.765884 -1.171063 1.583503
H  3.823961 0.195237 -0.983059
H  4.625584 0.154387 0.602749
H  3.367299 2.345094 0.211223
H  2.81318 1.449587 1.648587
H  2.197365 -2.046201 -1.984491
H  1.833618 -0.300101 -2.130456
H  0.508191 -1.496776 -2.118187
H  1.255247 -3.339602 0.124728
H  -0.327845 -2.512873 0.02189
H  0.640927 -2.405335 1.520208
H  -0.830648 0.278761 -1.30959
H  -0.133083 2.505065 -1.019011
H  1.509454 3.371136 -0.861118
H  -2.868374 0.557907 2.359126
H  -2.42423 -1.143617 2.220899
H  -1.14323 0.078125 2.49673
H  -4.342849 0.223282 -2.132815
H  -2.74488 -0.574682 -2.312123
H  -2.834302 1.196179 -2.105011
