program: Gaussian 09
title: 000112585
version: EM64L-G09RevD.01
frameworkgroup: C1[X(C24H27N2O4S)]
method: RPBEPBE
basis: SDD
operation: Freq
keyword: #p
keyword: freq=noraman
keyword: PBEPBE/SDD
title: #p freq=noraman PBEPBE/SDD
converged: YES YES NO NO
title: Mulliken charges:
elementType: S O O O O N N C C C C C C C C C C C C C C C C C C C C C C C C H H H H H H H H H H H H H H H H H H H H H H H H H H H
charge: 1.011213 -0.294444 -0.536790 -0.465251 -0.551340 -0.036695 -0.142564 0.261568 0.279409 0.121905 0.340761 0.307914 -0.340602 -0.272116 -0.284459 -0.351806 -0.410489 -0.294981 -0.391401 -0.432950 -0.403796 0.394797 0.428292 -0.365738 -0.360149 -0.323283 -0.645774 -0.618136 -0.641290 -0.641131 -0.522414 0.203469 0.275860 0.291032 0.291102 0.291541 0.275093 0.260619 0.259657 0.250565 0.252936 0.263383 0.258542 0.259999 0.330216 0.271849 0.263257 0.284172 0.244757 0.234466 0.244822 0.233682 0.245827 0.246283 0.397583 0.239100 0.265597 0.246329
chargesum: 1.00000
title: Mulliken charges with hydrogens summed into heavy atoms:
elementType: S O O O O N N C C C C C C C C C C C C C C C C C C C C C C C C
charge: 1.011213 -0.294444 -0.139207 -0.465251 -0.551340 -0.036695 -0.142564 0.261568 0.279409 0.121905 0.340761 0.307914 -0.137134 0.003745 0.006573 -0.060703 -0.118948 -0.294981 -0.116308 -0.172331 -0.144139 0.394797 0.428292 -0.115173 -0.107212 -0.059900 0.202984 0.201142 0.082754 0.084661 0.228612
polarizability: 6.06068009e+02 -7.98606713e+01 5.41702647e+02 7.01108405e+00 7.44438765e+00 1.89840811e+02
1716.lowfreq: -3.6153 -1.0547 -0.0009 0.0005 0.0010 4.5420 23.5707 26.8475 31.3860
frequency: 23.5538 26.8372 31.3799 32.7564 37.1023 48.0836 55.0812 73.5944 80.2220 89.4629 96.7411 108.2396 113.5843 118.5220 124.3906 137.9932 149.7382 155.3497 166.6544 174.7132 186.0085 191.0665 195.7019 209.5558 218.9051 224.9492 239.3885 252.3428 263.3198 280.0405 293.5080 298.7424 310.9683 316.0673 327.5804 336.3833 354.4012 358.3245 384.6427 391.6192 412.8117 420.8902 429.1188 433.9105 462.1239 471.4882 491.0806 516.4055 531.7704 535.2380 566.0557 578.6620 589.7880 608.4117 627.3587 657.1711 668.1808 669.2234 692.7096 717.0931 729.1030 735.6971 737.2435 749.2304 787.7382 813.9524 829.7559 831.6949 832.4313 839.5195 860.0283 910.7638 920.9210 922.9063 930.6006 939.6680 948.1857 959.4694 963.2222 969.9112 971.8470 979.1167 992.1033 1021.2071 1025.4505 1049.9510 1054.1864 1075.4720 1081.5716 1098.8217 1112.7607 1113.2253 1120.0178 1133.4133 1137.6391 1143.7039 1148.4916 1166.8997 1168.4724 1190.8621 1202.5559 1212.4539 1224.3104 1247.7074 1251.4622 1273.4470 1282.9580 1290.1435 1301.2374 1324.6030 1344.6601 1367.0948 1373.4370 1406.8577 1412.7605 1426.8436 1431.1486 1432.1669 1437.0608 1441.3424 1457.1291 1459.4605 1463.3188 1467.2768 1467.3583 1469.8996 1471.9354 1481.1655 1484.9376 1486.1552 1487.1435 1487.3354 1501.7559 1526.2579 1536.2017 1540.4480 1555.4406 1614.0655 1619.1735 1638.4499 1688.6218 2961.5832 2967.3294 2986.5679 2990.2423 3012.7861 3035.4628 3038.6342 3093.2155 3094.7799 3105.3858 3113.0222 3114.3729 3124.2023 3134.3185 3136.5628 3147.4990 3150.9433 3154.1110 3155.5345 3163.5453 3171.9430 3173.9048 3176.0069 3187.7120 3203.2347 3256.0578 3435.3997
redmass: 5.8234 4.6045 5.1606 4.8011 4.5216 3.8580 4.7221 3.0614 4.4067 3.5555 2.5597 4.1865 3.3955 4.0204 1.3591 2.4984 1.4690 4.0179 3.4413 2.7148 1.4330 2.1331 1.8260 2.1184 2.5663 3.3705 1.5594 4.8097 5.1974 4.5408 5.2553 3.5309 2.1857 3.9434 4.5305 4.3229 4.0651 3.9883 3.1207 3.1465 3.1256 3.2443 3.5944 8.0386 3.7733 3.7081 3.9238 3.0370 4.0102 4.9257 7.0030 5.0468 4.9322 4.1978 6.6112 4.3684 5.5961 4.9415 1.3990 4.6645 4.2427 4.6047 6.1159 4.9971 5.9730 1.2643 3.4300 2.4958 1.6524 4.7168 1.6078 1.3983 1.6410 2.6557 3.2880 3.2280 1.4140 7.7742 1.3414 1.7885 2.9766 1.3760 2.9783 2.1243 2.6682 1.4187 1.5379 1.8181 1.2397 1.2360 1.3396 1.2515 1.2560 2.4370 1.5472 1.4327 1.6517 1.5713 1.3697 1.8050 2.6738 1.1739 1.9073 2.7420 3.5154 1.4013 1.9235 2.0649 1.7146 1.5688 2.7572 3.8963 2.5020 3.2404 2.9363 2.8939 1.1638 1.1898 1.2737 1.2621 2.8097 1.2719 1.0578 1.0781 1.0477 1.0540 1.0507 1.0467 1.2571 1.4534 1.2927 1.1406 1.1719 4.6587 3.1643 5.3545 6.7748 7.2131 6.2821 6.5614 7.3742 1.0369 1.0390 1.0426 1.0316 1.0350 1.1001 1.1028 1.1059 1.0951 1.1028 1.0892 1.0973 1.0954 1.0890 1.0893 1.1017 1.1007 1.0900 1.1015 1.0903 1.0933 1.0954 1.0943 1.0843 1.0972 1.1097 1.0653
irintensity: 0.8808 4.5851 4.9708 1.6852 2.5939 2.4607 2.9889 2.5111 3.2948 0.7697 0.4107 14.6526 2.9580 1.2888 2.3343 4.6630 1.8046 4.8788 0.8904 6.7667 1.5618 0.1395 2.4956 6.1851 1.0221 1.7661 2.6301 6.1050 2.6944 11.5760 4.4225 14.7979 98.1957 8.0449 6.8268 2.4701 16.1116 3.6844 0.4324 3.4052 4.7851 13.5805 67.2221 84.3734 5.4006 4.8036 3.4835 7.7871 4.6821 27.7297 116.7296 15.8716 7.4783 6.4972 0.7568 4.9522 8.6825 47.2832 43.3374 420.5068 45.2107 37.1981 64.8748 18.1639 4.3429 20.2759 6.0217 157.1550 25.6272 40.2111 14.0377 4.0089 7.3370 39.1291 8.2895 20.2840 21.4039 83.9709 1.6653 33.4392 67.0197 10.3383 1.0266 1.5745 40.6722 79.4301 21.3862 2.4873 2.5182 1.2741 0.8464 0.6610 66.2515 102.6665 6.8524 3.3240 87.5523 0.1325 30.4071 60.5298 0.4253 135.1402 17.1810 19.0757 180.8583 52.0453 83.7583 8.0079 19.5885 14.7539 40.4779 10.1795 158.6689 385.2145 180.4066 144.6890 26.3393 7.4852 1.3038 20.0258 0.9957 10.5799 17.6596 46.3516 8.9963 21.0773 29.6018 29.0151 53.7934 46.4251 86.3692 5.7222 113.3942 96.8837 99.6978 60.7839 181.8435 269.1731 616.8027 177.0285 227.0170 62.4457 150.7640 17.0279 46.6191 7.7752 5.1357 50.5970 21.4892 12.4916 2.9111 3.1286 2.9437 35.5271 4.3068 4.6835 3.5258 9.4259 0.4797 2.9496 5.1577 10.6168 3.5251 12.9331 10.6083 10.8681 38.1399 56.9576
temp: 298.150 k
press: 1.00000 atm
elementType: 16 8 8 8 8 7 7 6 6 6 6 6 6 6 6 6 6 6 6 6 6 6 6 6 6 6 6 6 6 6 6 1 1 1 1 1 1 1 1 1 1 1 1 1 1 1 1 1 1 1 1 1 1 1 1 1 1 1
symmnumber: 1
zpe: 1198816.1 jmol-1
zpe.correction: 0.456605 hartree
zpe.thermalcorrener: 0.489572 hartree
zpe.thermalcorrenthalpy: 0.490516 hartree
zpe.thermalcorrgfe: 0.390888 hartree
zpe.sumelectzpe: -1736.449290 hartree
zpe.sumelectthermal: -1736.416323 hartree
zpe.sumelectthermalent: -1736.415378 hartree
zpe.sumelectthermalfe: -1736.515007 hartree
dipole: 6.8354 5.8097 -3.7836
dipole: 9.7360
quadrupole: -108.3347 -63.7601 -191.5816
quadrupole: -21.3740 19.4172 7.6633
quadrupole: 12.8908 57.4654 -70.3562 -21.3740 19.4172 7.6633
hfenergy: -1736.9058949 hartree
pointgroup: C01 [X(C24H27N2O4S1)]
dipole: -3.4191579 -0.9627372 -1.433453 debye
polarizability: 528.2473546|-73.1259891|614.4660472|1.1824792|-47.2634174|194.8980649 unknown
InChI: InChI=1S/C24H27N2O4S/c1-25(2)20-11-6-17(7-12-20)21(13-8-18-9-14-22(18)26(3)4)19-10-15-23(30-5)24(16-19)31(27,28)29/h6-16,27H,1-5H3
charge 1 multiplicity 1
58 atoms
S  4.481261 -0.9075 0.79249
O  4.929514 1.729804 -0.66949
O  5.488428 -1.167139 -0.723364
O  5.387834 -0.295024 1.971898
O  3.703535 -2.3166 0.987339
N  0.343951 -5.010864 0.026756
N  -5.094785 3.687891 -0.320248
C  -0.574456 0.13427 -0.238329
C  -1.826155 -3.448777 0.292147
C  -0.902388 -4.682114 0.329886
C  0.813608 0.679279 -0.262005
C  -1.724643 1.04564 -0.273725
C  -0.671815 -1.266968 -0.199844
C  -1.808109 -2.076853 0.112509
C  -2.860885 -4.370183 0.803797
C  -2.017028 -5.49146 0.87356
C  1.868692 -0.085318 0.308885
C  3.192758 0.300945 0.134202
C  1.175508 1.889831 -0.917985
C  -2.914999 0.729318 -1.000369
C  -1.706116 2.297092 0.419325
C  -4.003929 2.833453 -0.306367
C  3.568624 1.48724 -0.538863
C  -4.016933 1.590431 -1.029514
C  -2.806522 3.159891 0.419948
C  2.52024 2.297583 -1.047529
C  1.337986 -4.117979 -0.632322
C  0.8632 -6.374028 0.33461
C  -6.316241 3.324365 -1.061077
C  -5.040414 4.976106 0.395057
C  5.364442 3.017104 -1.250348
H  0.266266 -1.805482 -0.342058
H  -2.762438 -1.571349 0.31342
H  -3.913555 -4.218314 1.05002
H  -2.140941 -6.529456 1.169844
H  1.660348 -0.988149 0.889336
H  0.392418 2.502336 -1.375984
H  -2.942745 -0.183086 -1.60694
H  -0.821791 2.572008 1.005398
H  -4.883757 1.316264 -1.636189
H  -2.746759 4.088111 0.993628
H  2.751418 3.225202 -1.578663
H  0.827669 -3.404031 -1.291846
H  2.005061 -4.743467 -1.246822
H  1.960871 -3.587616 0.113089
H  1.030098 -6.926708 -0.605836
H  0.158193 -6.925824 0.969959
H  1.823998 -6.271211 0.86614
H  -6.122682 3.230678 -2.147679
H  -7.076146 4.106727 -0.918741
H  -6.74043 2.368611 -0.697817
H  -5.985814 5.517619 0.244182
H  -4.218392 5.615008 0.018647
H  -4.900167 4.831831 1.48401
H  5.975605 -0.301373 -0.874018
H  5.055509 3.09007 -2.30862
H  6.460154 3.004837 -1.175718
H  4.95684 3.859433 -0.664276
