program: Gaussian 09
title: 000113254
version: EM64L-G09RevD.01
frameworkgroup: C1[X(C22H23ClN6O5)]
method: RPBEPBE
basis: SDD
operation: Freq
keyword: #p
keyword: freq=noraman
keyword: PBEPBE/SDD
title: #p freq=noraman PBEPBE/SDD
converged: YES YES NO NO
title: Mulliken charges:
elementType: Cl O O O O O N N N N N N C C C C C C C C C C C C C C C C C C C C C C H H H H H H H H H H H H H H H H H H H H H H H
charge: 0.021972 -0.216097 -0.220512 -0.283458 -0.185339 -0.215472 -0.184704 -0.157307 -0.437089 -0.051538 -0.265584 0.004992 -0.354236 -0.431285 -0.518349 -0.516128 0.197118 0.203085 -0.380377 0.554706 -0.473829 -0.667494 -0.378407 0.393542 -0.353800 -0.065788 0.198685 -0.770107 0.307222 -0.307617 -0.374951 0.508624 -0.270437 -0.327039 0.251813 0.237092 0.234718 0.270109 0.309890 0.256979 0.272155 0.260015 0.226323 0.248787 0.308256 0.228819 0.239887 0.219713 0.243483 0.256074 0.381146 0.259015 0.228464 0.252220 0.305591 0.240666 0.285787
chargesum: 0.00000
title: Mulliken charges with hydrogens summed into heavy atoms:
elementType: Cl O O O O O N N N N N N C C C C C C C C C C C C C C C C C C C C C C
charge: 0.021972 -0.216097 -0.220512 -0.283458 -0.185339 -0.215472 -0.184704 -0.157307 -0.055943 -0.051538 -0.265584 0.004992 0.134669 0.073542 0.048520 0.016042 0.197118 0.203085 0.094732 0.554706 -0.165573 0.020924 -0.134924 0.393542 -0.097726 -0.065788 0.198685 -0.030408 0.307222 -0.002026 -0.134286 0.508624 -0.270437 -0.041252
polarizability: 7.99243023e+02 8.35307805e+01 3.62218019e+02 -3.70810833e+01 2.80250019e+01 1.87014702e+02
1716.lowfreq: -7.3684 0.0008 0.0011 0.0011 1.6246 3.3313 12.9441 18.0232 18.7909
frequency: 12.8878 17.5932 18.7423 30.2402 32.4734 35.1425 36.7015 43.1367 54.6112 56.1685 74.0374 81.1286 92.6239 100.7751 110.4315 122.4085 123.5554 147.3013 152.0261 160.3876 175.1969 184.2685 198.8821 208.1925 225.6240 246.1186 255.7964 269.8029 291.3676 296.7023 321.3866 333.0402 354.2652 360.6070 371.8513 393.4281 411.4885 425.2127 445.4420 448.7223 460.8933 476.9819 503.1147 526.5463 530.0186 534.1315 543.9640 551.5705 563.7935 581.2058 592.1221 600.4157 603.5651 633.4522 641.5979 654.5740 656.1321 667.8802 673.0176 683.4462 709.8334 725.3681 755.1694 774.5407 779.7016 808.7137 825.9402 833.1709 840.1498 850.9108 876.1607 888.0386 909.5154 913.9067 917.3282 945.0656 957.5425 965.8707 974.6642 974.8933 1007.0527 1011.0015 1012.7993 1013.1275 1033.7783 1036.0801 1062.7200 1076.6157 1085.8281 1087.7988 1112.2292 1117.2049 1138.1353 1146.0127 1157.1988 1159.5271 1174.1722 1191.8579 1196.7910 1206.8051 1216.3490 1224.7583 1250.6332 1258.6789 1265.4914 1277.5461 1282.0523 1300.2609 1301.3415 1328.1578 1329.0055 1340.8244 1347.5258 1350.5761 1359.1350 1378.2138 1381.6596 1388.8566 1389.5394 1391.7970 1396.5184 1412.6487 1430.1455 1435.4884 1447.2354 1449.2081 1450.3240 1463.5252 1467.9376 1473.2277 1477.3452 1487.0357 1500.6411 1507.7210 1524.1630 1552.3699 1564.3018 1592.5012 1620.4640 1628.8821 1652.7949 1692.8842 2833.7884 2989.1869 2989.8359 2997.5995 3016.5613 3018.2071 3027.3677 3034.6188 3066.6941 3078.4084 3082.6315 3087.5644 3093.2925 3093.8104 3097.7068 3099.1192 3107.8242 3157.5488 3158.2506 3182.4468 3185.2991 3187.8434 3198.4862
redmass: 7.7337 7.3162 6.3590 1.8800 2.1109 5.3118 4.8903 15.6570 6.7287 5.0233 3.3656 4.7869 3.5000 3.9142 5.4566 4.2298 7.5302 2.6355 5.4641 4.6249 3.6260 3.5133 1.8864 5.4481 5.6280 4.2535 4.4232 4.7817 6.8544 2.9131 4.8444 5.3086 7.7301 5.1079 5.5538 5.4865 4.9357 4.4379 3.1091 4.9257 3.0191 3.4105 4.6726 3.7450 5.1477 3.6281 3.4102 4.0220 4.6680 5.6360 3.2612 5.0845 3.0903 6.5587 6.0214 3.9240 5.7743 4.1137 5.7427 4.5665 6.8440 4.8061 3.3892 5.7418 1.3511 1.6387 1.6003 3.5395 1.4979 3.8223 2.3853 1.5710 3.1331 1.4909 4.3503 4.7976 2.9764 1.3444 1.6728 1.8921 3.5716 1.8689 2.2513 2.0493 1.9565 1.8977 2.7393 2.1435 4.2174 1.1916 2.2240 2.3784 1.5757 1.6657 1.3271 2.1496 4.5336 2.8055 6.1802 2.3516 1.1419 1.9197 1.6535 1.6086 1.8469 1.2086 2.1288 1.5916 2.3516 1.4344 3.6521 1.3517 2.9385 6.0365 1.3400 3.0745 1.8507 1.6696 1.2567 4.0651 1.6601 6.3300 1.0774 1.0990 1.1601 2.4608 1.0547 1.2132 1.0504 1.1374 1.7875 1.3895 1.8613 2.0581 3.4676 7.2609 4.7307 6.8687 3.8948 11.7173 2.1414 11.3393 1.0918 1.0494 1.0538 1.0359 1.0601 1.0620 1.0592 1.0627 1.1001 1.1030 1.1028 1.0994 1.0979 1.0968 1.1014 1.1018 1.1009 1.0888 1.0893 1.0916 1.0955 1.0950 1.0911
irintensity: 0.1546 0.0963 0.3986 0.3142 1.0225 0.4400 0.4768 1.5843 0.5194 4.0972 2.2894 2.6274 1.3150 3.9839 5.7704 0.6167 6.6876 14.9862 2.7111 3.0756 0.8134 0.1942 1.1407 0.3089 1.1857 0.7713 5.2923 2.5271 0.8672 4.0428 0.8183 1.9987 1.9573 10.5496 0.0359 6.1084 5.6066 2.4857 1.2666 16.7412 10.1716 4.2551 17.4563 3.3408 0.8598 2.8104 0.2159 2.4068 4.3470 1.8175 0.3648 16.5227 1.2419 3.8079 13.2949 0.1253 40.1957 19.0251 11.3195 0.7157 18.8148 1.6122 1.6719 11.8308 22.3221 28.1718 57.5780 15.7968 37.7340 87.8798 40.7788 21.4448 14.1234 21.5940 12.5650 18.4805 8.7130 5.8301 38.1471 38.6729 86.1644 2.2455 3.8000 9.7741 12.6188 8.9366 8.6751 66.7877 14.7089 84.3633 1.1226 78.4520 48.0662 119.5675 9.8827 113.2337 151.0145 111.7446 1477.4962 94.1087 1.7635 65.0306 164.2824 22.7435 22.0428 27.2625 237.3076 26.1255 312.1376 47.7374 642.2024 32.5882 95.6424 39.7081 36.0490 129.2580 10.8306 38.4963 79.6547 111.4779 125.5045 115.7189 15.2916 22.4127 88.8148 45.5695 11.3257 51.0502 11.1883 14.2295 28.1146 21.7642 66.7254 45.8249 212.2391 14.2264 417.9368 425.8732 538.0853 537.3326 285.9008 29.6603 282.0493 4.4325 76.2568 5.8347 13.5682 90.6040 17.8498 15.5152 0.3122 1.4923 8.0870 39.5233 6.9395 7.0761 45.3063 1.5897 13.8373 0.5344 6.0413 2.8075 0.5440 15.3440 5.1016
temp: 298.150 k
press: 1.00000 atm
elementType: 17 8 8 8 8 8 7 7 7 7 7 7 6 6 6 6 6 6 6 6 6 6 6 6 6 6 6 6 6 6 6 6 6 6 1 1 1 1 1 1 1 1 1 1 1 1 1 1 1 1 1 1 1 1 1 1 1
symmnumber: 1
zpe: 1130622.2 jmol-1
zpe.correction: 0.430631 hartree
zpe.thermalcorrener: 0.463162 hartree
zpe.thermalcorrenthalpy: 0.464106 hartree
zpe.thermalcorrgfe: 0.361044 hartree
zpe.sumelectzpe: -2014.302292 hartree
zpe.sumelectthermal: -2014.269761 hartree
zpe.sumelectthermalent: -2014.268817 hartree
zpe.sumelectthermalfe: -2014.371879 hartree
dipole: 10.3826 1.8142 -0.7133
dipole: 10.5640
quadrupole: -277.1187 -180.7273 -213.1890
quadrupole: 21.0938 6.7609 -12.6731
quadrupole: -53.4403 42.9510 10.4893 21.0938 6.7609 -12.6731
hfenergy: -2014.7329231 hartree
pointgroup: C01 [X(C22H23Cl1N6O5)]
dipole: 4.1336862 -0.1514083 0.4047402 debye
polarizability: 811.0635387|-21.4709149|354.0785474|51.7925461|8.5892887|183.3336581 unknown
InChI: InChI=1S/C22H23ClN6O5/c1-3-27(10-11-28-21(31)8-9-22(28)32)16-5-6-18(19(13-16)24-14(2)30)26-25-15-4-7-20(29(33)34)17(23)12-15/h4-7,12-13,24H,3,8-11H2,1-2H3
charge 0 multiplicity 1
57 atoms
Cl -6.52859 -3.359175 -0.280913
O  5.415028 2.968385 0.890346
O  4.535312 -0.322248 -2.317528
O  1.635911 2.653016 0.366079
O  -8.660952 -1.420092 -0.845702
O  -8.679057 0.543606 0.316739
N  5.029511 1.110757 -0.507975
N  3.931481 -1.638817 0.822766
N  -0.147839 1.128356 0.500248
N  -1.675996 -1.365104 0.207001
N  -2.365807 -0.222547 0.273853
N  -8.065895 -0.474496 -0.203662
C  5.711892 0.136494 0.346938
C  4.783101 -0.563363 1.374053
C  4.20484 3.203176 -1.295694
C  3.8959 2.106074 -2.344628
C  4.939961 2.489642 -0.166156
C  4.492677 0.81282 -1.783594
C  4.6314 -2.924725 0.579531
C  2.564442 -1.511187 0.626508
C  1.923614 -0.229891 0.660447
C  4.651922 -3.861446 1.809167
C  1.75055 -2.68003 0.387302
C  0.532059 -0.106113 0.503751
C  0.374556 -2.558393 0.254444
C  -0.29434 -1.29524 0.325551
C  0.389255 2.407996 0.44425
C  -0.640681 3.530627 0.480851
C  -3.770279 -0.375938 0.158377
C  -4.418853 -1.632168 -0.011917
C  -4.554705 0.809533 0.230854
C  -6.595011 -0.51208 -0.068209
C  -5.813088 -1.70008 -0.131596
C  -5.9485 0.735838 0.127157
H  6.488514 0.686025 0.909427
H  6.194915 -0.609233 -0.309162
H  5.437603 -1.019997 2.142993
H  4.166057 0.187004 1.892359
H  3.289965 3.648054 -0.870536
H  4.838269 4.017704 -1.686145
H  2.811677 1.956943 -2.487011
H  4.3337 2.305696 -3.33744
H  5.668406 -2.684563 0.283111
H  4.177901 -3.422099 -0.293934
H  2.497595 0.690676 0.762747
H  5.210102 -4.784944 1.571091
H  3.632209 -4.144175 2.12192
H  5.148181 -3.380161 2.67122
H  2.200174 -3.673328 0.340422
H  -0.255562 -3.440618 0.104382
H  -1.199751 0.981149 0.453116
H  -0.521268 4.099234 1.420368
H  -1.679542 3.165645 0.417644
H  -0.448718 4.229848 -0.35041
H  -3.809025 -2.538083 -0.043496
H  -4.054715 1.772741 0.370475
H  -6.57551 1.628796 0.192112
