program: Gaussian 09
title: 000108631
version: EM64L-G09RevD.01
frameworkgroup: C1[X(C8H12N4O2)]
method: RPBEPBE
basis: SDD
operation: Freq
keyword: #p
keyword: freq=noraman
keyword: PBEPBE/SDD
title: #p freq=noraman PBEPBE/SDD
converged: YES YES NO NO
title: Mulliken charges:
elementType: O O N N N N C C C C C C C C H H H H H H H H H H H H
charge: -0.271824 -0.327153 -0.385326 -0.426780 -0.086776 -0.601412 -0.122127 -0.573446 0.378994 0.162617 -0.477577 0.264145 -0.236762 -0.778584 0.282278 0.252800 0.258784 0.353532 0.379693 0.258091 0.256765 0.344115 0.350524 0.263260 0.241239 0.240931
chargesum: 0.00000
title: Mulliken charges with hydrogens summed into heavy atoms:
elementType: O O N N N N C C C C C C C C
charge: -0.271824 -0.327153 -0.031794 -0.047087 -0.086776 0.093227 0.160152 -0.061862 0.378994 0.162617 -0.219486 0.264145 0.020003 -0.033154
polarizability: 1.48954709e+02 -1.61647740e+00 1.23797568e+02 9.65916618e+00 7.92681694e+00 7.38535545e+01
1716.lowfreq: -91.1724 -5.4954 -0.0009 -0.0008 0.0005 6.2042 8.6124 45.3880 72.8820
frequency: -91.1699 45.3233 72.8717 83.7742 99.6573 124.8544 129.8344 157.3233 199.7390 280.9096 307.4423 314.9042 345.8298 399.9001 490.3385 562.3665 589.0247 593.4235 599.3716 624.5878 645.7711 656.0512 687.7166 713.6432 745.5971 794.2371 808.9174 835.1353 900.6564 918.8134 945.9518 959.7156 981.8652 989.9262 994.2181 1039.5419 1069.3078 1094.7108 1127.3591 1141.4752 1181.7684 1229.0033 1234.6119 1243.3870 1266.5359 1304.7800 1320.7617 1349.9435 1378.1165 1383.9652 1391.4752 1433.6248 1447.5196 1463.2790 1466.1867 1488.0117 1561.4742 1591.4233 1603.3274 1649.1170 2995.9375 2996.4591 3009.8081 3071.9652 3082.1787 3138.4840 3211.9951 3240.1415 3310.6435 3444.1130 3499.9538 3654.4661
redmass: 1.0321 5.4297 5.7897 4.6127 4.4778 5.5843 5.1837 4.6894 5.5413 5.0377 4.8948 2.7607 3.5783 3.1545 3.0172 1.3774 2.7749 1.3585 3.4581 4.3517 3.0256 3.6452 2.2951 1.3495 3.8607 1.3875 1.4203 2.7021 5.8295 2.7746 3.1656 1.3117 2.0346 3.1801 2.2222 1.6707 1.9356 2.5177 1.7800 2.4114 1.4800 1.4484 1.9843 1.5170 1.5586 1.5753 1.3972 4.1165 1.6521 1.8248 2.3116 2.8289 1.1580 1.1160 1.0471 2.4112 4.6148 2.9039 1.9416 3.1813 1.0742 1.0445 1.0648 1.1007 1.0981 1.0989 1.0979 1.0990 1.0889 1.0782 1.0460 1.1044
irintensity: 0.2668 8.7333 5.4681 2.1152 2.2962 15.8934 5.0556 20.0668 0.9674 2.8244 1.3339 2.1284 4.2015 4.4531 29.2124 3.5037 5.4399 221.9294 30.1899 3.6112 19.2652 27.7568 9.7580 102.1374 6.8136 45.7466 10.6745 3.8399 22.9795 5.7567 21.6031 103.5637 0.8836 16.0716 1.7977 8.0842 2.4854 36.8147 18.8822 4.9634 4.4888 3.6767 26.8733 1.6198 6.1542 8.8095 52.8437 14.1299 57.5534 78.7772 124.9688 20.0140 75.9667 15.8054 17.4305 289.5341 84.4055 213.8510 26.5178 232.7244 4.1285 8.4429 27.0403 11.3145 11.4775 6.7308 7.1159 3.6000 512.7160 114.8086 42.1280 58.8634
temp: 298.150 k
press: 1.00000 atm
elementType: 8 8 7 7 7 7 6 6 6 6 6 6 6 6 1 1 1 1 1 1 1 1 1 1 1 1
symmnumber: 1
zpe: 542605.4 jmol-1
zpe.correction: 0.206667 hartree
zpe.thermalcorrener: 0.219597 hartree
zpe.thermalcorrenthalpy: 0.220541 hartree
zpe.thermalcorrgfe: 0.166421 hartree
zpe.sumelectzpe: -680.492323 hartree
zpe.sumelectthermal: -680.479394 hartree
zpe.sumelectthermalent: -680.478450 hartree
zpe.sumelectthermalfe: -680.532570 hartree
dipole: 3.8109 1.1299 -0.0575
dipole: 3.9753
quadrupole: -102.1031 -74.4598 -81.5735
quadrupole: -10.6757 1.5732 -1.4084
quadrupole: -16.0576 11.5856 4.4720 -10.6757 1.5732 -1.4084
hfenergy: -680.6989907 hartree
pointgroup: C01 [X(C8H12N4O2)]
dipole: -1.5455903 -0.1124591 0.2112577 debye
dipolederiv: -1.0475872 0.0826727 0.2376234 -0.1863121 -0.6507369 -0.0699871 0.2217189 -0.1430034 -0.4619173 -1.1069393 -0.2122216 0.2005474 0.0548938 -0.8082947 -0.0612316 0.227779 0.0640632 -0.4209658 -0.5182459 -0.1986086 -0.0657196 0.009582 -1.2047916 -0.0953324 -0.0294105 -0.004933 -0.3993718 -0.5636251 0.2769286 0.0637055 0.3896855 -0.5324792 -0.0755346 0.0487346 -0.0497887 -0.1960145 -0.4735986 0.0791955 0.046288 0.0660687 -0.3505066 -0.0142612 0.0915154 -0.0230445 -0.2957993 -0.5095734 0.2482094 0.0553659 0.3101491 -0.826883 -0.2316782 0.0428463 -0.2224776 -0.7634201 -0.0243093 -0.4108033 -0.0103962 -0.3127803 0.1772845 -0.0188918 -0.0227607 0.0379877 0.2814604 0.2473007 0.0577549 0.0171578 0.0421757 0.0381991 -0.0465834 -0.0034559 0.0190549 0.108087 -0.0381237 -0.062158 -0.0543429 -0.2321011 0.2190031 0.039931 -0.0665349 -0.030306 -0.0877492 1.2428033 -0.1004919 -0.4015569 0.144167 1.1061758 0.4285749 -0.4095669 0.4345603 0.4980255 0.0053676 -0.0636292 -0.0925193 -0.0184365 0.0787001 -0.1203189 -0.1290481 -0.1046171 -0.1363291 1.066949 0.2457177 -0.2927572 0.0561505 1.5306215 0.1551351 -0.3148232 0.0507252 0.2983202 0.2679681 -0.1543286 -0.1546979 -0.1619929 0.2152087 -0.0066379 -0.1464474 0.0050198 -0.0239082 -0.2501798 0.230436 0.133355 0.13724 -0.167676 -0.0842724 0.1462325 -0.1243523 -0.0213697 0.0687296 0.0527793 0.0571567 0.0001222 0.008553 0.0261907 0.0527553 -0.0298743 -0.0645737 0.0413249 0.0258804 0.0123078 -0.0049913 -0.0852998 0.0897309 0.0163756 0.0490162 0.0762148 -0.0500707 -0.0275799 0.0551149 0.0208941 0.0226751 -0.1181938 0.0539733 -0.0835047 -0.0401881 0.1963607 0.1478419 0.070832 -0.0005171 0.3665512 0.0447173 0.0323533 -0.0233224 0.2914431 0.6786688 -0.1330489 -0.0569038 -0.2260077 0.3509272 0.0733407 -0.047762 0.0482301 0.2940181 0.1286874 0.0070175 0.03358 -0.0019892 -0.0421968 0.0742849 0.0455525 0.0729514 0.1499813 0.0959248 -0.0291635 0.0565177 -0.0285384 0.0083156 0.0652168 0.0596087 0.0648198 0.1456137 0.1840552 -0.014166 0.0589634 -0.0324641 0.2181944 -0.0475662 0.068067 -0.0365655 0.3347449 0.2279969 0.0033242 0.0622173 0.0098439 0.2331576 -0.0263107 0.0863459 0.0059591 0.3336551 0.0811087 -0.0863405 0.0086124 -0.0243746 -0.0542209 -0.0139154 0.0156078 0.0099928 0.1230078 -0.0423177 0.0204797 -0.0773654 -0.0169462 0.0854304 -0.046921 -0.1062343 -0.0138255 0.044441 0.0913249 0.0143022 0.0369142 0.0064788 0.0640881 0.0805142 0.0665776 0.0272344 -0.067406 unknown
polarizability: 141.2987038|-3.809784|125.9080487|-23.354131|4.6341437|79.399079 unknown
InChI: InChI=1S/C8H12N4O2/c1-5(13)12-7(8(9)14)2-6-3-10-4-11-6/h3-4,7,11-12H,2,9H2,1H3
charge 0 multiplicity 1
26 atoms
O  -2.918456 -1.740465 0.139517
O  -0.270431 2.368598 0.149577
N  -1.774919 0.642622 0.503533
N  2.012675 0.794998 -0.366928
N  3.735828 -0.584279 -0.872975
N  -1.059214 -2.665678 -0.916346
C  -0.876225 -0.377144 -0.038441
C  0.379157 -0.663633 0.888847
C  1.678673 -0.457404 0.167624
C  -1.718101 -1.650249 -0.263785
C  2.755339 -1.294644 -0.157878
C  -1.42031 1.968694 0.543479
C  3.249813 0.673237 -0.979213
C  -2.471494 2.927397 1.08694
H  -0.494679 -0.027544 -1.017467
H  0.33801 -1.693169 1.283769
H  0.300432 0.014963 1.757839
H  -2.711582 0.305726 0.765294
H  1.371075 1.605812 -0.290868
H  2.897942 -2.343954 0.096288
H  3.754191 1.497695 -1.477113
H  -1.54864 -3.544394 -1.0848
H  -0.092595 -2.561807 -1.229083
H  -2.068211 3.949631 1.060468
H  -3.395118 2.889542 0.481516
H  -2.739061 2.673555 2.128607
