program: Gaussian 09
title: 000108291
version: EM64L-G09RevD.01
frameworkgroup: C1[X(C13H17N4O2P)]
method: RPBEPBE
basis: SDD
operation: Freq
keyword: #p
keyword: freq=noraman
keyword: PBEPBE/SDD
title: #p freq=noraman PBEPBE/SDD
converged: YES YES NO NO
title: Mulliken charges:
elementType: P O O N N N N C C C C C C C C C C C C C H H H H H H H H H H H H H H H H H
charge: 1.080556 -0.657919 -0.262825 -0.408585 -0.407690 -0.440810 -0.492843 -0.390108 -0.400259 -0.394022 -0.398605 -0.621381 0.053420 0.299915 0.482698 -0.448192 -0.338136 -0.196705 -0.213355 -0.254739 0.247991 0.253032 0.263782 0.245723 0.255835 0.248169 0.245769 0.262880 0.265500 0.318090 0.299857 0.292438 0.215506 0.307292 0.227808 0.228997 0.230916
chargesum: 0.00000
title: Mulliken charges with hydrogens summed into heavy atoms:
elementType: P O O N N N N C C C C C C C C C C C C C
charge: 1.080556 -0.657919 -0.262825 -0.408585 -0.407690 -0.140953 -0.200404 0.110915 0.109246 0.109982 0.110044 -0.355881 0.371510 0.299915 0.482698 -0.232686 -0.030844 0.031102 0.015642 -0.023824
polarizability: 3.51127260e+02 3.48022541e-01 1.39935831e+02 6.32063663e+00 4.29248052e+00 1.68864229e+02
1716.lowfreq: -11.5510 -4.9243 -0.0020 -0.0018 -0.0014 5.6249 11.3037 21.2961 27.8417
frequency: 8.1376 21.1599 27.0319 38.0023 52.2531 55.8518 73.1214 101.7950 117.7453 119.6203 150.6873 156.9692 191.5436 206.3203 224.4531 244.4459 246.5700 314.4660 324.5719 338.6181 367.3992 391.8618 399.0081 407.4065 452.7264 481.2560 534.8567 561.2250 591.5616 607.6492 618.5366 635.1809 695.8154 698.1519 717.4679 767.0494 783.1697 795.0895 802.2959 807.8718 808.7466 816.8605 833.8971 840.0896 879.6502 886.1084 916.2486 972.2037 972.4750 984.4653 985.5302 993.1158 1000.5195 1002.9361 1012.8274 1028.9771 1062.7683 1071.0946 1091.4581 1105.9204 1112.5722 1114.0893 1118.3734 1148.8501 1152.4620 1153.6161 1173.3410 1185.6656 1190.5185 1229.9737 1235.5835 1240.6290 1273.5491 1285.8071 1322.1504 1384.3782 1428.9502 1440.7225 1443.9210 1454.7951 1456.3322 1460.2078 1486.8882 1519.0847 1603.9032 1616.4301 1639.1111 1673.9224 3070.8106 3072.0223 3076.5186 3078.5332 3104.2913 3134.1656 3139.8789 3146.0831 3149.6733 3167.0292 3180.7750 3181.6210 3196.7484 3197.8744 3198.7656 3519.7207 3530.5976
redmass: 4.0189 4.3825 3.7693 4.8002 4.2775 4.0416 5.1703 4.3064 3.9773 3.5520 6.3028 4.8353 5.0659 2.2707 6.6387 3.0978 3.1457 3.8103 4.8629 6.3158 5.9634 5.2326 5.7327 2.9224 5.5167 1.7237 2.0547 8.2874 7.1737 6.1372 6.3326 1.2236 1.9932 11.0549 6.9825 1.6864 7.7076 9.1428 1.1812 1.1232 1.6702 4.4069 5.4694 1.2716 4.3677 4.3715 1.4222 7.2663 1.4220 6.0418 1.0700 1.0911 1.3071 5.0689 1.1659 2.1596 1.2389 1.2472 1.5583 1.3104 1.3200 1.2843 1.3444 1.3836 1.9182 1.8314 1.0516 1.3592 1.1269 3.3294 3.2844 2.3879 2.3936 1.2752 1.4415 5.9263 2.2178 1.0782 1.0763 1.9105 1.1782 1.1763 2.3682 2.0625 5.0220 6.0029 7.6924 4.3889 1.0488 1.0486 1.0606 1.0607 1.0892 1.0866 1.0949 1.0932 1.0906 1.0998 1.1173 1.1177 1.0950 1.1175 1.1175 1.0770 1.0762
irintensity: 0.1338 1.3978 1.1465 0.6006 1.9821 3.3483 8.4927 2.5620 5.4761 2.3050 12.0603 9.4889 0.0787 7.0647 30.1129 0.0654 2.5913 1.5611 0.1032 0.7950 6.2031 9.1573 36.0123 0.0270 20.6360 17.0875 12.3493 62.3619 100.3148 7.6889 18.5778 67.2847 50.3386 13.6849 99.9311 91.4966 0.1204 17.3561 3.0339 25.4719 141.1851 109.6203 3.9270 0.1953 194.0649 207.4269 13.9903 30.2142 2.0112 2.8249 2.0639 13.0109 2.0355 19.3119 49.0442 3.8441 1.3100 11.3981 19.7386 6.7924 3.5055 20.0561 5.4878 0.0703 116.9495 59.7049 1.3061 5.3143 5.1874 58.8699 145.6529 461.2872 3.2727 197.2736 61.6545 74.3965 39.2010 5.3435 8.3971 384.3484 1.2139 7.5222 52.2128 689.0800 73.2185 80.9298 329.3579 263.9349 8.2361 19.7305 40.1919 25.2496 18.2826 0.1317 7.1950 28.1024 21.1919 26.2362 0.5234 1.2515 8.3297 9.6740 20.2670 4.2786 20.6122
temp: 298.150 k
press: 1.00000 atm
elementType: 15 8 8 7 7 7 7 6 6 6 6 6 6 6 6 6 6 6 6 6 1 1 1 1 1 1 1 1 1 1 1 1 1 1 1 1 1
symmnumber: 1
zpe: 754160.4 jmol-1
zpe.correction: 0.287245 hartree
zpe.thermalcorrener: 0.308022 hartree
zpe.thermalcorrenthalpy: 0.308966 hartree
zpe.thermalcorrgfe: 0.233131 hartree
zpe.sumelectzpe: -1214.678598 hartree
zpe.sumelectthermal: -1214.657821 hartree
zpe.sumelectthermalent: -1214.656877 hartree
zpe.sumelectthermalfe: -1214.732711 hartree
dipole: 1.7333 -0.3493 -4.7011
dipole: 5.0227
quadrupole: -104.1888 -121.6945 -125.6563
quadrupole: -0.7534 -9.6129 0.4865
quadrupole: 12.9911 -4.5146 -8.4765 -0.7534 -9.6129 0.4865
hfenergy: -1214.9658423 hartree
pointgroup: C01 [X(C13H17N4O2P1)]
dipole: 0.654078 0.3622319 -1.8291521 debye
polarizability: 349.6340743|17.6717197|141.0569582|6.6340178|-2.2292719|169.2362882 unknown
InChI: InChI=1S/C13H17N4O2P/c18-13(15-12-4-2-1-3-5-12)14-6-11-20(19,16-7-8-16)17-9-10-17/h1-6,11,14-15H,7-10H2
charge 0 multiplicity 1
37 atoms
P  -3.50642 -0.357728 -0.052475
O  -3.321929 -0.642036 1.530207
O  1.644314 -0.087624 1.187656
N  -4.321494 -1.649548 -1.00544
N  -4.554075 1.0431 -0.484866
N  0.479448 0.133667 -0.837575
N  2.815494 0.324496 -0.825675
C  -5.429416 -2.4248 -0.311814
C  -4.080386 -3.077268 -0.54152
C  -5.711957 1.343921 0.453815
C  -4.4871 2.23672 0.455737
C  -1.952871 -0.056272 -0.95374
C  -0.775169 -0.076258 -0.266434
C  1.669636 0.109429 -0.05708
C  4.168012 0.37926 -0.374975
C  5.167246 0.598892 -1.361483
C  4.541693 0.228935 0.986724
C  6.525875 0.668668 -0.994038
C  5.907429 0.301987 1.336479
C  6.905952 0.520678 0.360223
H  -6.277069 -2.664215 -0.960333
H  -5.674672 -2.159523 0.724477
H  -3.449657 -3.230357 0.343633
H  -3.946495 -3.791887 -1.358781
H  -5.845766 0.695819 1.329343
H  -6.626083 1.660948 -0.056281
H  -4.50942 3.203944 -0.054685
H  -3.82647 2.166147 1.329379
H  -2.03682 0.128944 -2.030173
H  -0.749322 -0.266469 0.81375
H  0.525212 0.314792 -1.843035
H  2.696448 0.455234 -1.83278
H  4.88154 0.71486 -2.41579
H  3.772222 0.058304 1.741384
H  7.285275 0.83819 -1.765178
H  6.189864 0.185286 2.388705
H  7.961128 0.574562 0.647641
