program: Gaussian 09
title: 000108290
version: EM64L-G09RevD.01
frameworkgroup: C1[X(C14H19Cl2NO2)]
method: RPBEPBE
basis: SDD
operation: Freq
keyword: #p
keyword: freq=noraman
keyword: PBEPBE/SDD
title: #p freq=noraman PBEPBE/SDD
converged: YES YES NO NO
title: Mulliken charges:
elementType: Cl Cl O O N C C C C C C C C C C C C C C H H H H H H H H H H H H H H H H H H H
charge: -0.096305 -0.090373 -0.440691 -0.255221 -0.191909 -0.360601 -0.396928 0.301199 -0.310203 -0.298892 0.322128 -0.497460 -0.643471 -0.636354 -0.362800 0.273398 -0.833357 -0.365400 0.095230 0.248926 0.220966 0.245523 0.232844 0.282447 0.278443 0.280226 0.230127 0.244937 0.218361 0.231282 0.248177 0.210464 0.235636 0.220005 0.231877 0.270177 0.274914 0.382679
chargesum: 0.00000
title: Mulliken charges with hydrogens summed into heavy atoms:
elementType: Cl Cl O O N C C C C C C C C C C C C C C
charge: -0.096305 -0.090373 -0.058013 -0.255221 -0.191909 0.109291 0.081440 0.301199 -0.027755 -0.020448 0.322128 -0.217234 0.049953 0.053569 -0.127164 0.273398 -0.111299 -0.090486 0.095230
polarizability: 2.19958361e+02 -6.17380745e-02 1.37626297e+02 1.04964090e+01 -4.57985600e+00 2.04490104e+02
1716.lowfreq: -8.9089 -0.0030 -0.0014 -0.0009 2.8844 6.7855 15.3722 22.9202 32.3983
frequency: 13.9909 22.7247 32.2167 42.8287 51.8673 68.2604 71.0368 108.5677 119.9783 140.4462 167.4675 203.5541 212.7480 218.5770 222.2668 260.0837 268.7806 296.3647 305.9197 314.9219 330.7109 344.7611 374.9419 389.9902 397.7770 439.2065 448.2052 510.7464 530.1577 543.3271 553.4000 566.8691 580.5512 584.4886 630.3271 690.9548 723.1698 734.1679 741.9856 843.7784 848.9641 878.4717 883.0523 896.4524 921.9184 928.2422 973.8185 996.7116 999.7781 1010.0644 1026.3246 1045.1368 1048.5961 1094.0530 1097.2681 1113.0226 1124.2151 1141.6054 1150.7741 1168.5224 1190.1436 1217.8215 1233.8644 1257.9020 1272.4405 1290.2273 1299.4149 1305.0516 1321.9262 1341.5222 1348.1692 1365.3894 1376.3357 1392.1320 1394.7003 1395.8697 1416.4056 1440.5028 1458.8732 1460.7408 1466.8906 1472.9796 1475.1830 1481.4291 1483.5318 1495.3548 1568.7164 1610.5997 1640.9091 2942.7412 2960.7198 2979.4123 2984.9955 2985.1195 3044.0007 3050.7118 3063.0661 3066.8884 3072.7760 3082.3126 3086.0770 3086.9726 3108.9600 3110.4317 3127.7552 3154.9971 3181.1827 3530.4835
redmass: 7.5551 11.2757 5.6480 5.1995 5.9036 4.4239 4.7659 3.8294 8.2654 7.5748 3.7001 2.9112 1.2829 1.1319 1.1477 2.5791 2.2774 3.3777 3.5588 3.6982 3.9976 4.7528 3.7661 2.9629 2.2739 3.0423 3.0700 3.2175 4.5622 3.3314 4.0119 4.3408 2.3159 3.1118 2.2439 5.2357 4.3251 4.8788 3.0619 1.4059 3.1863 2.4111 1.9447 1.5725 1.6341 1.5573 1.3513 1.4664 2.7453 1.6692 1.9392 1.5552 2.6015 2.4678 2.4091 1.9174 1.8784 1.9214 1.6237 1.7502 1.6172 1.7244 1.7581 1.5228 1.4134 1.3875 1.2094 1.5423 2.0419 1.7968 1.3843 1.4799 5.4673 1.2148 1.2268 1.2746 2.8533 1.1118 1.0565 1.0502 1.0770 1.0605 1.0482 1.0992 1.1218 2.9536 6.5876 6.2893 8.5413 1.0691 1.0416 1.0537 1.0437 1.0403 1.0910 1.0959 1.0888 1.0933 1.0937 1.0939 1.0930 1.0996 1.0999 1.0998 1.0900 1.0909 1.0948 1.0641
irintensity: 1.2477 0.7048 0.2542 4.9225 0.8914 3.0407 0.5140 0.1237 1.1314 2.2648 0.9680 0.5315 0.5806 0.4225 1.6872 0.0736 0.7299 0.9741 2.0456 2.5995 8.0511 1.3888 0.4035 2.9175 8.9268 4.6825 24.2478 12.6625 4.4836 17.3218 18.1031 54.1129 55.2796 30.0038 59.8689 10.4533 3.5150 35.0366 13.3239 17.8305 1.4733 38.8401 23.9157 4.3736 1.5225 13.2998 1.6428 3.5780 176.8979 53.6266 31.6738 13.6269 117.1024 11.5655 8.6769 33.8743 40.1833 17.1962 60.3046 32.7338 46.7009 22.4806 23.2343 7.4622 25.1323 6.0046 16.5504 4.0171 99.2543 59.7757 6.4349 12.1757 3.1337 20.7959 24.9489 34.2797 89.3981 17.9717 1.1695 20.8004 8.2799 31.9709 7.6897 7.1081 25.4525 24.6239 54.3347 41.2610 233.3143 35.4185 34.9505 7.2573 56.9174 7.2960 15.9920 4.2224 1.2478 2.1486 1.5233 26.0949 40.1756 7.2560 19.8720 21.7248 17.7637 3.2249 1.7437 47.0019
temp: 298.150 k
press: 1.00000 atm
elementType: 17 17 8 8 7 6 6 6 6 6 6 6 6 6 6 6 6 6 6 1 1 1 1 1 1 1 1 1 1 1 1 1 1 1 1 1 1 1
symmnumber: 1
zpe: 798768.9 jmol-1
zpe.correction: 0.304235 hartree
zpe.thermalcorrener: 0.325213 hartree
zpe.thermalcorrenthalpy: 0.326157 hartree
zpe.thermalcorrgfe: 0.251368 hartree
zpe.sumelectzpe: -1668.780612 hartree
zpe.sumelectthermal: -1668.759635 hartree
zpe.sumelectthermalent: -1668.758690 hartree
zpe.sumelectthermalfe: -1668.833479 hartree
dipole: -0.1341 0.7444 2.5627
dipole: 2.6720
quadrupole: -122.7591 -130.3694 -125.4566
quadrupole: 5.8887 -1.2131 11.5159
quadrupole: 3.4359 -4.1744 0.7384 5.8887 -1.2131 11.5159
hfenergy: -1669.0848474 hartree
pointgroup: C01 [X(C14H19Cl2N1O2)]
dipole: 0.0559847 -0.433176 0.9561915 debye
polarizability: 219.055937|13.1587046|139.8166722|-8.5813959|-6.4141969|203.2021523 unknown
InChI: InChI=1S/C14H19Cl2NO2/c1-9-4-5-12(14(18)19)6-13(9)17(7-10(2)15)8-11(3)16/h4-6,10-11,18H,7-8H2,1-3H3
charge 0 multiplicity 1
38 atoms
Cl -3.37253 2.4674 0.586476
Cl -1.861228 -2.433607 -2.213815
O  4.647332 0.758668 -0.329125
O  3.208689 0.683279 -2.148995
N  -1.439753 -0.072737 0.065924
C  -1.894177 0.740234 -1.073432
C  -2.159287 -1.316215 0.368982
C  -0.1039 0.095461 0.553745
C  -2.00572 2.238144 -0.745281
C  -1.614578 -2.590244 -0.312801
C  0.160346 0.136943 1.967014
C  0.974855 0.268851 -0.350877
C  -2.366382 3.099418 -1.955486
C  -2.304614 -3.873748 0.149587
C  1.502577 0.285007 2.40229
C  2.300634 0.448038 0.109451
C  -0.960269 0.10384 2.986272
C  2.572712 0.43792 1.500672
C  3.369841 0.633402 -0.904086
H  -2.879468 0.366818 -1.399345
H  -1.230383 0.64773 -1.96129
H  -3.225149 -1.187327 0.107984
H  -2.125046 -1.51672 1.458589
H  -1.102511 2.604891 -0.231215
H  -0.51774 -2.648355 -0.217147
H  0.806843 0.250489 -1.432408
H  -3.302888 2.751534 -2.425423
H  -2.493853 4.155236 -1.666626
H  -1.556206 3.041869 -2.708178
H  -3.396624 -3.814858 -0.003751
H  -1.923949 -4.748844 -0.401732
H  -2.111849 -4.034915 1.228334
H  1.699554 0.317244 3.480539
H  -1.23065 -0.929455 3.28453
H  -0.661705 0.633597 3.907209
H  -1.867058 0.58405 2.576664
H  3.598666 0.569087 1.853635
H  5.310168 0.881877 -1.060384
