program: Gaussian 09
title: 000107098
version: EM64L-G09RevD.01
frameworkgroup: C1[X(C14H20O2)]
method: RPBEPBE
basis: SDD
operation: Freq
keyword: #pfreq=noraman
keyword: PBEPBE/SDD
title: #p freq=noraman PBEPBE/SDD
converged: NO YES NO NO
title: Mulliken charges:
elementType: O O C C C C C C C C C C C C C C H H H H H H H H H H H H H H H H H H H H
charge: -0.269874 -0.275509 0.178501 -0.414321 0.015866 0.484391 -0.809365 -0.724765 -0.716124 -0.406558 -0.387657 -0.255534 -0.266381 -0.260845 0.315260 -0.766231 0.211745 0.189722 0.249740 0.216894 0.260091 0.212369 0.227338 0.215572 0.206475 0.209289 0.223118 0.232785 0.255872 0.218959 0.225680 0.222339 0.228599 0.275748 0.239818 0.236994
chargesum: 0.00000
title: Mulliken charges with hydrogens summed into heavy atoms:
elementType: O O C C C C C C C C C C C C C C
charge: -0.269874 -0.275509 0.178501 -0.012854 0.265606 0.484391 -0.120011 -0.075379 -0.050932 -0.150686 -0.168698 -0.029855 -0.044043 -0.032246 0.315260 -0.013671
polarizability: 1.62021017e+02 -2.69919202e+01 1.41793283e+02 -2.26842233e+00 -3.54936751e+00 1.43999991e+02
1716.lowfreq: -12.9643 -2.7559 -0.0002 -0.0001 0.0004 12.7083 38.7671 47.8574 62.2033
frequency: 38.7084 47.6287 62.1600 69.3522 92.5641 100.6691 152.2245 167.6632 186.7174 210.9708 213.7072 241.1940 252.5782 277.3943 314.4499 334.6243 345.2997 389.5920 396.4589 404.4274 433.2824 469.7540 476.4062 524.9964 562.8004 577.7542 601.3359 617.5302 702.4466 704.8377 753.2050 773.8403 835.7466 849.6035 868.5735 901.5929 913.0656 933.2363 937.0935 971.5734 975.3415 990.3246 991.6599 999.4581 1002.5669 1026.6403 1030.3851 1046.7296 1075.1521 1090.1582 1110.0803 1138.3439 1168.4493 1172.3685 1196.4687 1203.5006 1206.7709 1213.2129 1290.5908 1301.3962 1322.9806 1328.8169 1362.5024 1373.8640 1381.9663 1384.9099 1386.6636 1402.4677 1432.6568 1444.5673 1452.9332 1456.0438 1463.5417 1467.7220 1470.1057 1476.0099 1486.5272 1487.4142 1509.5255 1586.8333 1610.4980 1639.6412 2970.9507 2974.0967 2978.6315 2987.4381 3003.7578 3028.2891 3047.0266 3064.5770 3068.8073 3079.0827 3082.8838 3086.2735 3094.9825 3097.5482 3116.3370 3125.3376 3138.3475 3139.2228 3154.3970 3167.7100
redmass: 4.1665 3.8064 7.9206 4.3056 1.2867 2.1382 2.8932 3.4242 1.7624 2.7589 1.6478 1.1030 2.7729 2.9681 2.3502 2.6363 1.2300 3.5010 2.4483 2.7778 2.3356 3.0407 3.0902 3.0523 3.1238 3.0163 4.6445 6.3867 2.0496 3.1539 3.0579 1.9959 2.2301 1.2561 2.3053 2.8383 1.5422 2.0846 1.5270 1.5987 1.5230 4.3803 1.3944 1.8336 1.3097 2.3697 1.9139 1.6305 2.0175 1.8020 2.0761 2.1613 2.4741 1.0754 1.4333 1.5413 3.0148 2.2939 1.8379 1.3016 1.3717 1.3422 1.4319 4.8394 1.3068 1.2389 1.2312 1.1986 2.1983 1.0856 1.0636 1.0533 1.0523 1.0760 1.0995 1.0519 1.4660 1.2688 1.0566 5.8555 5.9867 9.1158 1.0369 1.0531 1.0409 1.0364 1.0377 1.0938 1.0907 1.0994 1.0987 1.0999 1.0998 1.0986 1.1002 1.0949 1.0848 1.0874 1.0939 1.1017 1.0966 1.0976
irintensity: 0.2625 0.0231 2.7159 0.0391 2.3579 3.2674 0.5615 1.9604 3.0779 1.8505 2.3158 0.3905 0.7856 0.4838 1.5787 0.4651 1.0772 4.1522 1.0797 0.0146 0.0288 1.9387 12.1241 1.6841 11.8640 2.2287 4.4704 0.0636 36.9427 17.5937 5.0082 43.5494 4.9503 1.1269 3.0124 18.9923 3.4881 23.8914 5.8620 4.8340 3.6756 0.1004 0.2058 54.8409 4.3241 3.1876 36.5316 16.8473 3.4035 24.3387 7.2280 33.3428 23.1102 0.7447 12.0338 4.2638 185.9535 11.6826 7.7496 1.4089 0.5772 5.3099 7.2297 4.9982 11.5575 50.5274 15.1716 23.2038 14.0733 5.8650 14.5253 11.9060 6.4957 12.1013 1.6298 13.2971 13.5675 14.2971 12.9708 1.2963 9.6321 147.4226 17.5601 28.2159 40.0796 34.0477 5.2816 6.1638 10.8849 6.0025 70.2373 28.5054 26.9316 32.3518 27.2825 5.3427 6.0204 2.1789 27.8973 15.2983 33.1018 8.2663
temp: 298.150 k
press: 1.00000 atm
elementType: 8 8 6 6 6 6 6 6 6 6 6 6 6 6 6 6 1 1 1 1 1 1 1 1 1 1 1 1 1 1 1 1 1 1 1 1
symmnumber: 1
zpe: 803116.2 jmol-1
zpe.correction: 0.305891 hartree
zpe.thermalcorrener: 0.323070 hartree
zpe.thermalcorrenthalpy: 0.324014 hartree
zpe.thermalcorrgfe: 0.261304 hartree
zpe.sumelectzpe: -694.721198 hartree
zpe.sumelectthermal: -694.704019 hartree
zpe.sumelectthermalent: -694.703075 hartree
zpe.sumelectthermalfe: -694.765784 hartree
dipole: -0.2528 0.9348 -1.7597
dipole: 2.0086
quadrupole: -92.0960 -94.7123 -98.3184
quadrupole: -7.4885 2.3151 3.2430
quadrupole: 2.9462 0.3300 -3.2762 -7.4885 2.3151 3.2430
hfenergy: -695.0270883 hartree
pointgroup: C01 [X(C14H20O2)]
dipole: 0.1151088 0.2994421 -0.7221881 debye
polarizability: 128.3807842|-17.3031489|174.8494947|-2.0269323|-3.1011719|144.5840123 unknown
InChI: InChI=1S/C14H20O2/c1-11(16-12(2)15)10-14(3,4)13-8-6-5-7-9-13/h5-9,11H,10H2,1-4H3
charge 0 multiplicity 1
36 atoms
O  -1.867042 -0.146296 -0.575069
O  -2.041694 -0.619224 1.70993
C  0.729019 1.628339 0.124491
C  -0.536396 1.935042 -0.750887
C  -1.887015 1.335529 -0.31665
C  1.207766 0.163447 -0.0357
C  0.443266 2.001944 1.602961
C  1.873349 2.559154 -0.390936
C  -3.063666 1.891941 -1.129387
C  1.435118 -0.6904 1.073744
C  1.49983 -0.349881 -1.330214
C  1.937855 -2.002022 0.900644
C  1.996743 -1.657587 -1.510615
C  2.222919 -2.494439 -0.391604
C  -1.942236 -1.009979 0.522358
C  -1.864328 -2.447744 0.062106
H  -0.350683 1.638706 -1.801517
H  -0.668442 3.037043 -0.757265
H  -2.063188 1.476194 0.764675
H  1.368435 1.960975 2.206615
H  -0.301946 1.335854 2.072125
H  0.059315 3.037994 1.657498
H  2.811913 2.360206 0.157103
H  2.07148 2.404002 -1.46714
H  1.603075 3.622042 -0.242184
H  -3.154406 2.982647 -0.974109
H  -2.919834 1.703718 -2.208329
H  -4.010503 1.418537 -0.817514
H  1.215435 -0.343342 2.087138
H  1.335346 0.276309 -2.215052
H  2.104075 -2.63626 1.779134
H  2.210508 -2.023594 -2.521572
H  2.615931 -3.508419 -0.526907
H  -0.810018 -2.691757 -0.163196
H  -2.448863 -2.596602 -0.859837
H  -2.222416 -3.114477 0.860467
