program: Gaussian 09
title: 000016231
version: EM64L-G09RevD.01
frameworkgroup: C1[X(C6H8ClN7O)]
method: RPBEPBE
basis: SDD
operation: Freq
keyword: #p
keyword: freq=noraman
keyword: PBEPBE/SDD
title: #p freq=noraman PBEPBE/SDD
converged: YES YES NO NO
title: Mulliken charges:
elementType: Cl O N N N N N N N C C C C C C H H H H H H H H
charge: -0.085796 -0.308452 -0.067517 0.142827 -0.626116 -0.074336 -0.615054 -0.618641 -0.605997 -0.118575 0.130666 0.282467 -0.418811 0.051391 0.265661 0.313998 0.385219 0.331615 0.331232 0.341729 0.310962 0.337449 0.314078
chargesum: 0.00000
title: Mulliken charges with hydrogens summed into heavy atoms:
elementType: Cl O N N N N N N N C C C C C C
charge: -0.085796 -0.308452 -0.067517 0.142827 0.073101 -0.074336 0.047793 0.034050 0.045530 -0.118575 0.130666 0.282467 -0.418811 0.051391 0.265661
polarizability: 1.79449494e+02 -3.22693719e+00 1.79309553e+02 7.36698650e+00 9.43241410e-01 6.78861888e+01
1716.lowfreq: -3.8863 -0.0021 -0.0021 -0.0016 6.7433 8.6666 36.3980 55.4464 61.2260
frequency: 36.3665 55.4372 61.2219 86.5713 122.6852 157.2583 175.0835 243.7271 253.7791 280.0806 322.8574 329.3455 339.2922 356.9051 389.8021 431.9725 448.0644 466.0041 493.6601 504.7846 521.3409 526.6025 534.8533 562.6599 576.6893 586.2440 624.3090 663.6269 676.2616 706.4186 709.9760 737.6449 775.0798 846.8133 920.6819 974.1673 1019.1381 1036.0249 1053.2105 1161.9252 1166.5500 1275.3402 1297.4182 1381.8907 1412.2505 1452.3373 1456.4698 1468.0666 1539.9589 1553.2478 1576.6430 1611.3461 1617.3799 1633.0627 1690.3485 3262.4373 3537.6048 3540.1956 3556.5945 3623.6755 3682.0336 3692.3289 3706.6945
redmass: 6.8410 4.2109 4.0072 5.6923 8.2059 6.3792 9.9375 8.3353 5.1254 1.2217 2.9031 9.6471 5.4983 4.8529 4.1600 1.5134 2.5207 2.7155 1.3717 1.3856 2.2147 1.1708 1.2528 1.4545 3.7292 8.5874 6.5267 9.0152 7.8901 8.4376 10.9321 8.2796 5.8134 1.1654 6.2170 2.4523 2.3460 1.8697 1.7914 2.2139 3.2620 6.6445 5.9561 5.6429 2.7242 4.8587 4.5478 4.1250 2.9594 3.0713 2.7714 1.2841 1.7927 1.2417 4.8530 1.0624 1.0444 1.0460 1.0456 1.0899 1.1027 1.1055 1.1045
irintensity: 9.1493 2.7984 6.0385 1.6803 4.8641 10.5410 2.9403 3.3373 0.1582 64.9333 9.6423 28.8829 10.9884 3.6438 16.6844 101.0758 54.6362 41.5767 335.7286 65.3011 28.2402 11.3061 201.4353 227.2931 57.4992 5.8185 29.2970 12.5459 39.1104 2.9631 6.6803 21.5741 0.8136 130.2556 140.2612 10.8212 88.8251 49.7974 12.6798 7.2392 33.3931 2.5443 312.6261 58.8231 160.0606 80.3605 219.9789 162.6277 144.9713 135.4465 614.3619 155.6084 626.6704 41.6181 793.8290 191.9290 127.8433 40.1974 53.1461 78.2306 20.7378 49.9476 36.4428
temp: 298.150 k
press: 1.00000 atm
elementType: 17 8 7 7 7 7 7 7 7 6 6 6 6 6 6 1 1 1 1 1 1 1 1
symmnumber: 1
zpe: 427679.6 jmol-1
zpe.correction: 0.162895 hartree
zpe.thermalcorrener: 0.177709 hartree
zpe.thermalcorrenthalpy: 0.178653 hartree
zpe.thermalcorrgfe: 0.120634 hartree
zpe.sumelectzpe: -1150.925017 hartree
zpe.sumelectthermal: -1150.910203 hartree
zpe.sumelectthermalent: -1150.909259 hartree
zpe.sumelectthermalfe: -1150.967278 hartree
dipole: 2.3144 -3.5948 2.2602
dipole: 4.8361
quadrupole: -78.2242 -87.2027 -90.1850
quadrupole: 20.7556 -1.3417 -0.3810
quadrupole: 6.9798 -1.9987 -4.9811 20.7556 -1.3417 -0.3810
hfenergy: -1151.0879118 hartree
pointgroup: C01 [X(C6H8Cl1N7O1)]
dipole: -0.7692378 1.185514 1.2739459 debye
dipolederiv: -0.2188591 0.1254666 0.0351257 0.3074377 -0.9590591 -0.1923301 0.0812026 -0.199491 -0.1493942 -0.844022 0.1140756 0.0324577 0.0555195 -1.173746 -0.2157777 0.027367 -0.2282892 -0.4495109 -0.6116301 0.2273053 0.0715858 0.3076722 -0.7898131 -0.1382148 0.1003203 -0.1299312 -0.3386804 0.077095 0.0252348 -0.0180036 -0.6550516 -0.0142313 0.0837506 -0.1740108 0.0160648 -0.0730905 -0.3426845 0.0575888 -0.0408576 0.0629306 -1.4043644 -0.1822186 -0.0251655 -0.147611 -0.662534 -1.3653284 -0.5572904 -0.0212227 -1.2888826 -1.5371854 -0.4297982 -0.0780183 -0.265101 -0.6963516 -1.6107033 0.4131356 0.1753479 0.3548978 -0.2995151 0.0450075 0.2045157 0.0270185 -0.7045992 -0.8874593 -0.1783007 0.1298423 -0.4832766 -1.1477773 0.1924962 0.1720109 0.2203201 -0.3592466 -0.7489863 -0.0200059 -0.1612022 -0.1297528 -0.3032215 0.0931217 -0.4002493 -0.0886731 -1.2093889 -0.7930918 -0.3934196 -0.0305289 0.574667 -0.6072395 -0.2154688 0.1368913 -0.0532757 -0.0556751 0.382905 -0.0334106 -0.0279531 -0.0799197 1.5760946 0.3163959 -0.0108206 0.2975081 0.2861433 1.9188899 -0.3779266 -0.2521332 0.0261682 0.3337915 0.0211459 -0.1933572 0.0574105 0.3061982 -0.714149 -0.0691203 0.0337824 -0.6954375 1.2314158 0.3151553 -0.0620351 0.274259 -0.0076482 2.2383636 0.2619338 -0.0308286 0.4316177 1.5560969 0.3750734 -0.258167 0.1928833 0.2498452 0.9733774 0.6017722 -0.1920976 1.4300627 1.7348218 0.1737439 0.3662682 0.2683325 1.6178803 0.1242183 -0.0184922 0.024357 -0.0010761 0.2767614 -0.0183623 0.0287668 -0.0224229 0.358286 0.493695 0.1110779 0.0292156 0.0098337 0.3505792 0.0069464 -0.0208112 -0.0277886 0.34941 0.2819412 -0.0166988 0.0085876 0.0376637 0.1479263 -0.0525095 0.013317 -0.0479148 0.3678275 0.2859519 -0.0371521 0.0031199 -0.0809786 0.2199893 -0.024738 -0.0120595 -0.0246586 0.372392 0.3524977 -0.0582133 0.0054889 -0.0258619 0.2671274 -0.0407086 -0.0411004 -0.0557861 0.1935897 0.241253 -0.1523091 -0.034657 -0.0499073 0.2889042 -0.0148821 -0.0243437 -0.006595 0.1390431 0.3468426 -0.0711569 0.0980764 -0.0841869 0.1306164 -0.0609947 0.128269 -0.0354276 0.244809 0.419883 0.0459059 0.1624975 -0.0241391 0.1220277 -0.0368336 0.04121 -0.020831 0.220695 unknown
polarizability: 178.3092872|-0.1295706|172.2117824|-11.7154903|28.0463404|76.1241664 unknown
InChI: InChI=1S/C6H8ClN7O/c7-2-4(9)13-3(8)1(12-2)5(15)14-6(10)11/h8-11H2
charge 0 multiplicity 1
23 atoms
Cl -1.666476 2.748428 0.916167
O  1.825491 -2.375311 -0.609515
N  -2.227728 -1.244918 0.143584
N  -0.103134 0.586619 0.259137
N  -0.738407 -2.970691 -0.405881
N  2.570777 -0.180452 -0.347374
N  -3.743614 0.465042 0.687887
N  3.506825 1.912468 0.076838
N  2.625816 0.707001 1.885391
C  0.173821 -0.719802 -0.043191
C  -0.937775 -1.656926 -0.103542
C  -2.455499 0.060762 0.446049
C  -1.337373 0.967408 0.499477
C  1.586232 -1.141583 -0.315267
C  2.848934 0.776644 0.512227
H  -1.540871 -3.596023 -0.448598
H  0.243125 -3.242029 -0.600819
H  -4.490407 -0.223248 0.62286
H  -3.943562 1.439023 0.90482
H  3.637377 2.0149 -0.92607
H  4.037195 2.502874 0.712155
H  2.174024 -0.127658 2.251872
H  2.533328 1.561873 2.431094
