program: Gaussian 09
title: 000107074
version: EM64L-G09RevD.01
frameworkgroup: C1[X(C14H22O2)]
method: RPBEPBE
basis: SDD
operation: Freq
keyword: #pfreq=noraman
keyword: PBEPBE/SDD
title: #p freq=noraman PBEPBE/SDD
converged: YES YES NO NO
title: Mulliken charges:
elementType: O O C C C C C C C C C C C C C C H H H H H H H H H H H H H H H H H H H H H H
charge: -0.302401 -0.275822 -0.101270 -0.098901 -0.070250 -0.480248 -0.462740 -0.473441 -0.459231 -0.445520 -0.447184 -0.426530 0.271172 -0.350894 -0.073822 -0.734124 0.246481 0.216256 0.258227 0.225254 0.205071 0.190002 0.252390 0.217151 0.196990 0.211348 0.236176 0.221446 0.211464 0.203263 0.215375 0.213355 0.203123 0.255950 0.252232 0.234033 0.231496 0.234124
chargesum: 0.00000
title: Mulliken charges with hydrogens summed into heavy atoms:
elementType: O O C C C C C C C C C C C C C C
charge: -0.302401 -0.275822 0.145211 0.117355 0.187977 -0.049924 -0.020348 -0.059301 -0.011707 -0.012611 -0.028546 -0.010052 0.271172 -0.094944 0.178409 -0.034471
polarizability: 1.95762392e+02 1.98034125e+01 1.55035675e+02 1.24867847e+00 -4.72175620e+00 1.23704936e+02
1716.lowfreq: -43.0700 -17.9881 -0.0011 -0.0009 -0.0008 3.6621 7.1716 21.8528 24.8024
frequency: -42.1799 20.0476 24.5475 39.5585 66.9709 96.2829 113.7961 124.3589 132.3596 197.9258 199.0171 203.2719 230.6204 269.8263 283.0999 333.6078 367.6147 385.6163 444.3981 466.5562 550.6107 579.6763 615.1346 652.8216 654.2834 711.9748 764.7399 782.7987 810.1757 840.4791 857.7890 866.2142 883.9704 895.5904 904.4637 916.1485 918.7138 946.3991 953.9773 968.7848 971.8521 984.9166 989.2003 1033.1764 1053.0360 1056.9512 1071.6056 1088.7420 1096.1321 1104.3977 1113.5669 1123.6373 1151.2993 1164.1367 1174.1309 1190.8713 1200.9062 1219.5370 1226.8718 1247.6999 1265.9938 1270.4750 1281.9138 1289.3228 1290.7990 1295.8993 1296.5508 1298.8278 1302.6144 1308.1762 1310.4397 1329.1990 1345.5474 1357.8014 1394.3009 1455.2535 1457.8716 1462.3766 1464.8817 1468.4478 1471.0927 1473.8517 1478.3781 1490.4066 1610.4256 1669.0878 2934.8982 2967.4664 2968.8717 2969.3098 2975.7704 2979.7302 2990.5410 2997.1956 2997.9278 3007.2567 3035.9963 3041.9403 3047.7696 3050.5998 3056.3829 3058.6059 3064.9086 3074.2796 3079.7846 3084.6394 3109.5828 3150.7231
redmass: 1.6212 3.8187 4.0136 3.1548 3.2371 3.1612 2.6495 1.8176 2.5282 2.2886 2.1780 1.8500 5.6738 3.1054 3.2876 2.6931 3.2590 3.7222 2.8741 2.7373 2.3597 2.1476 2.6240 3.9366 3.4914 3.8613 1.3083 2.3607 1.5896 1.8780 2.0855 3.0562 2.8553 2.3071 1.8868 1.9927 2.5429 2.2206 1.5687 1.5795 1.5104 3.7695 1.0768 1.7106 1.5980 2.8744 2.5971 1.8138 2.0194 1.8205 1.4764 2.8369 2.3332 1.9410 1.4816 1.4238 1.5468 1.3263 1.2112 1.3482 1.3473 1.2761 1.2360 1.3951 1.2581 1.2771 1.3620 1.3326 1.3921 1.4438 1.3289 1.4476 1.3796 1.7237 1.2321 1.0839 1.0472 1.0805 1.0712 1.0860 1.0846 1.0842 1.1002 1.1004 11.1049 5.8095 1.0816 1.0776 1.0634 1.0377 1.0655 1.0704 1.0610 1.0600 1.0672 1.0653 1.0983 1.0957 1.0875 1.0997 1.1000 1.0972 1.1006 1.1045 1.1023 1.0969 1.0934 1.0922
irintensity: 0.0040 0.9805 0.4181 1.8404 1.8251 1.1959 0.3789 0.5254 0.3707 0.2481 0.2795 0.5808 7.1404 2.5575 0.2249 2.5352 0.8757 5.8144 2.5335 1.2627 0.8181 3.4788 0.6760 4.6072 12.6882 1.5911 4.1138 2.1218 1.2524 2.1002 7.8545 2.7399 3.9720 2.4605 11.4512 5.3348 5.1662 19.3693 0.7506 11.5641 14.6242 169.6730 57.5458 15.9343 0.2415 2.8708 6.0227 9.6233 140.8778 2.0030 1.3595 0.3031 162.5655 42.8783 1.2155 1.5874 1.0529 4.6658 1.6445 1.8314 0.8322 0.9637 3.6219 76.5404 11.7875 0.1253 17.5555 6.1977 1.0850 4.2396 1.9261 6.0347 7.3480 0.8441 13.9645 10.1654 15.7969 1.8361 43.7655 7.8459 7.1152 12.9396 7.6750 2.4987 159.2825 109.0169 9.9309 12.6238 22.7030 17.4247 15.2759 79.7378 34.0877 35.3422 30.9189 62.8522 27.6523 17.3726 5.9497 13.1114 7.6326 39.7036 38.1776 97.8241 63.0083 10.4918 15.4551 8.8436
temp: 298.150 k
press: 1.00000 atm
elementType: 8 8 6 6 6 6 6 6 6 6 6 6 6 6 6 6 1 1 1 1 1 1 1 1 1 1 1 1 1 1 1 1 1 1 1 1 1 1
symmnumber: 1
zpe: 868016.4 jmol-1
zpe.correction: 0.330610 hartree
zpe.thermalcorrener: 0.346803 hartree
zpe.thermalcorrenthalpy: 0.347747 hartree
zpe.thermalcorrgfe: 0.284480 hartree
zpe.sumelectzpe: -695.875193 hartree
zpe.sumelectthermal: -695.859000 hartree
zpe.sumelectthermalent: -695.858055 hartree
zpe.sumelectthermalfe: -695.921322 hartree
dipole: -0.5164 0.4347 -1.6449
dipole: 1.7780
quadrupole: -83.7648 -96.0919 -100.0805
quadrupole: 4.5412 6.1730 2.3848
quadrupole: 9.5476 -2.7795 -6.7681 4.5412 6.1730 2.3848
hfenergy: -696.2058028 hartree
pointgroup: C01 [X(C14H22O2)]
dipole: -0.1780974 0.0761046 -0.67216 debye
polarizability: 191.3374333|23.9386432|157.8461982|3.1274384|-6.9958908|125.319372 unknown
InChI: InChI=1S/C14H22O2/c1-2-6-14(15)16-13-10-5-9-12(13)11-7-3-4-8-11/h2,6,11-13H,3-5,7-10H2,1H3
charge 0 multiplicity 1
38 atoms
O  -1.125663 0.692423 -0.372289
O  -1.898566 -0.448104 1.530402
C  1.355645 0.811458 -0.367927
C  2.158805 -0.299995 0.33733
C  0.054986 1.232185 0.38626
C  2.132473 2.144854 -0.577156
C  1.417777 -1.658219 0.469345
C  3.463516 -0.710172 -0.40011
C  -0.000383 2.781615 0.369312
C  1.018132 3.21029 -0.717683
C  2.537325 -2.670594 0.836465
C  3.851302 -2.096946 0.197601
C  -2.02793 -0.130068 0.31918
C  -3.121135 -0.547229 -0.589787
C  -4.127363 -1.355434 -0.153841
C  -5.282567 -1.834642 -0.99033
H  1.037255 0.434524 -1.362614
H  2.427546 0.054016 1.357931
H  -0.00589 0.814175 1.40602
H  2.809183 2.102722 -1.448561
H  2.752353 2.363698 0.316588
H  0.971121 -1.917722 -0.512599
H  0.596994 -1.637684 1.208105
H  4.269934 0.038099 -0.295109
H  3.244896 -0.806141 -1.483453
H  0.321929 3.163853 1.356991
H  -1.026864 3.14442 0.190112
H  1.382187 4.244161 -0.582363
H  0.55519 3.141654 -1.720865
H  2.307131 -3.689174 0.475793
H  2.643472 -2.735257 1.935621
H  4.638739 -1.986121 0.965807
H  4.257141 -2.768775 -0.580312
H  -3.076751 -0.173458 -1.618171
H  -4.0906 -1.68288 0.896259
H  -5.309424 -2.941555 -1.021913
H  -5.23217 -1.457274 -2.025777
H  -6.245425 -1.5129 -0.547063
