program: Gaussian 09
title: 000107067
version: EM64L-G09RevD.01
frameworkgroup: C1[X(C12H18O2)]
method: RPBEPBE
basis: SDD
operation: Freq
keyword: #pfreq=noraman
keyword: PBEPBE/SDD
title: #p freq=noraman PBEPBE/SDD
converged: YES YES NO NO
title: Mulliken charges:
elementType: O O C C C C C C C C C C C C H H H H H H H H H H H H H H H H H H
charge: -0.319098 -0.448469 -0.189515 -0.252549 -0.117077 -0.140204 -0.529045 -0.033090 -0.542229 -0.532789 -0.283922 -0.216702 -0.252146 -0.326229 0.242946 0.251578 0.227465 0.240316 0.220358 0.251299 0.223842 0.225514 0.236555 0.220173 0.217839 0.238922 0.229347 0.186408 0.211972 0.207334 0.199910 0.351286
chargesum: 0.00000
title: Mulliken charges with hydrogens summed into heavy atoms:
elementType: O O C C C C C C C C C C C C
charge: -0.319098 -0.097183 0.053431 -0.000970 0.110388 0.100111 -0.057389 0.190752 -0.080160 -0.094777 -0.045000 0.012646 0.146234 0.081015
polarizability: 1.47753231e+02 4.35002183e+00 1.19007957e+02 9.19416516e+00 -3.13108861e+00 1.08244083e+02
1716.lowfreq: -16.9428 0.0002 0.0005 0.0006 6.6832 14.3452 33.6499 44.7588 80.0851
frequency: 33.3627 44.3158 79.9644 107.9067 152.0842 194.2705 227.5970 261.8680 270.5679 358.4236 378.8806 418.6049 439.8851 459.9729 486.1593 526.0417 575.8493 678.2738 716.3544 743.8074 771.4710 781.0917 794.0597 815.1511 851.1231 862.0930 872.9748 911.2331 924.6856 941.1090 945.5848 957.2373 964.5881 965.5830 988.2391 1008.8057 1022.8187 1033.9175 1042.7556 1053.8708 1065.7182 1090.1257 1094.8063 1100.8856 1111.3596 1130.1128 1151.0522 1159.6265 1188.3967 1190.6080 1203.3500 1210.7233 1246.2284 1252.8486 1266.7084 1270.5691 1284.1957 1289.2105 1299.7365 1305.9888 1316.9746 1327.1435 1330.9225 1342.1921 1374.8894 1385.3046 1460.6502 1460.8240 1464.1824 1467.2650 1478.6843 1631.1221 2935.0200 2941.0363 2959.3779 2968.9197 3001.1648 3004.8403 3006.2174 3008.5452 3012.9943 3034.2987 3051.9210 3062.9012 3076.4294 3079.9767 3080.6251 3125.5502 3160.5236 3541.8403
redmass: 5.6556 3.6131 2.7850 3.8626 2.9792 3.3834 4.3001 2.4801 2.5562 2.4120 2.3651 2.5073 2.6097 1.2265 2.2043 4.3078 3.3931 1.9701 2.1408 3.3061 2.9158 3.3245 3.1008 2.9268 2.2384 2.7112 2.3747 2.3139 2.6258 1.8487 1.4128 1.7352 2.1585 1.9667 2.2356 2.0283 2.6764 1.6842 1.8060 2.9961 2.4688 1.7659 1.4374 1.2227 1.1256 1.5747 1.4181 1.5555 1.2025 1.4429 1.5606 1.2814 1.5297 1.4743 1.3482 1.3907 1.4999 1.5021 1.5021 1.4692 1.5502 1.2242 1.3279 1.7419 1.3546 1.2904 1.0859 1.0936 1.0867 1.0863 1.0926 6.2980 1.0628 1.0800 1.0621 1.0700 1.0896 1.0930 1.0960 1.0632 1.0617 1.0884 1.0873 1.0924 1.1033 1.0972 1.1041 1.0854 1.1064 1.0652
irintensity: 0.7823 1.8848 0.6347 2.7697 1.3819 4.4260 6.4135 0.0423 1.4280 3.7607 6.3073 11.9809 2.9349 210.9064 3.3289 0.3880 7.9854 30.6798 19.3642 8.8959 3.2182 2.4034 4.6137 5.4267 4.1393 14.8937 11.2252 4.3851 2.3984 1.6864 3.0756 8.9868 11.5158 7.4453 15.4226 27.5175 60.5312 0.6358 10.3828 44.3931 48.2186 7.5878 10.7792 1.4696 4.5131 22.2350 11.1065 5.9865 5.7115 7.7617 3.7458 13.0583 3.8914 5.2122 0.4777 2.7102 2.3709 1.4803 2.0558 3.4152 3.7275 19.5340 24.7097 1.8429 5.0702 19.1156 5.5332 9.7575 5.2252 15.6501 10.3261 3.5982 23.8137 83.2678 46.2475 45.8684 14.7030 36.1217 48.8972 46.2542 42.4484 56.6643 79.4569 6.9890 29.7584 36.5569 36.7309 6.5827 37.4270 7.0498
temp: 298.150 k
press: 1.00000 atm
elementType: 8 8 6 6 6 6 6 6 6 6 6 6 6 6 1 1 1 1 1 1 1 1 1 1 1 1 1 1 1 1 1 1
symmnumber: 1
zpe: 727731.3 jmol-1
zpe.correction: 0.277178 hartree
zpe.thermalcorrener: 0.289796 hartree
zpe.thermalcorrenthalpy: 0.290740 hartree
zpe.thermalcorrgfe: 0.237371 hartree
zpe.sumelectzpe: -617.384459 hartree
zpe.sumelectthermal: -617.371841 hartree
zpe.sumelectthermalent: -617.370897 hartree
zpe.sumelectthermalfe: -617.424267 hartree
dipole: -1.2832 2.3649 1.5411
dipole: 3.1007
quadrupole: -85.5843 -88.8905 -82.2566
quadrupole: 6.8253 7.2512 -1.5042
quadrupole: -0.0072 -3.3133 3.3205 6.8253 7.2512 -1.5042
hfenergy: -617.6616372 hartree
pointgroup: C01 [X(C12H18O2)]
dipole: -0.4998855 0.9361181 0.6016434 debye
polarizability: 147.5435718|3.8668973|118.8973217|9.8825518|-3.1680098|108.5643773 unknown
InChI: InChI=1S/C12H18O2/c13-4-5-14-12-7-8-6-11(12)10-3-1-2-9(8)10/h1,3,8-13H,2,4-7H2
charge 0 multiplicity 1
32 atoms
O  1.969048 0.589749 -0.203881
O  3.449918 -1.720828 -0.811896
C  -1.443223 1.413629 -0.599396
C  -0.244435 0.442669 1.090335
C  -1.484429 -0.097086 -0.981141
C  -0.619566 -0.768408 0.171082
C  -1.496315 1.358042 0.957616
C  0.81676 1.317521 0.346628
C  0.004404 1.941436 -0.834807
C  -2.90139 -0.759371 -0.906992
C  -1.563449 -1.774883 0.801644
C  -2.792373 -1.774758 0.221644
C  2.869395 0.035202 0.820677
C  3.988455 -0.658694 0.043657
H  -2.225101 2.01576 -1.09173
H  0.038517 0.157934 2.117468
H  -1.033208 -0.259091 -1.976251
H  0.300231 -1.252491 -0.208005
H  -1.36558 2.348955 1.430734
H  -2.410836 0.888244 1.357228
H  1.199722 2.100277 1.038201
H  0.427918 1.60997 -1.799516
H  0.041501 3.044628 -0.807817
H  -3.181383 -1.244397 -1.862811
H  -3.691944 -0.007944 -0.699063
H  -1.262509 -2.423377 1.632377
H  -3.625372 -2.424205 0.514217
H  3.270877 0.847299 1.4669
H  2.327283 -0.697647 1.453141
H  4.692474 -1.154316 0.733199
H  4.537815 0.094342 -0.559351
H  2.707494 -1.312859 -1.329192
