program: Gaussian 09
title: 000106894
version: EM64L-G09RevD.01
frameworkgroup: C1[X(C12H20)]
method: RPBEPBE
basis: SDD
operation: Freq
keyword: #p
keyword: freq=noraman
keyword: PBEPBE/SDD
title: #p freq=noraman PBEPBE/SDD
converged: YES YES NO NO
title: Mulliken charges:
elementType: C C C C C C C C C C C C H H H H H H H H H H H H H H H H H H H H
charge: -0.197155 -0.076195 -0.111092 -0.548005 0.432756 -0.409160 0.502633 -0.762368 -0.738984 -0.835986 -0.852423 -0.740965 0.193209 0.222516 0.214114 0.207826 0.206598 0.208271 0.238534 0.200822 0.210526 0.212210 0.231369 0.210333 0.227915 0.218273 0.219768 0.229068 0.234257 0.223732 0.213467 0.214135
chargesum: 0.00000
title: Mulliken charges with hydrogens summed into heavy atoms:
elementType: C C C C C C C C C C C C
charge: -0.003946 0.146322 0.103022 -0.133581 0.432756 -0.200889 0.502633 -0.112485 -0.085071 -0.170031 -0.165366 -0.313364
polarizability: 1.45769598e+02 -6.94700578e+00 1.25569707e+02 -5.71316477e+00 3.79149544e+00 1.07318802e+02
1716.lowfreq: -18.2361 -0.0004 0.0004 0.0004 8.9566 16.2675 57.0006 59.9110 115.8555
frequency: 56.8709 59.6761 115.8407 142.0111 160.1763 182.2175 202.2149 209.0906 244.5345 250.9841 252.1013 270.6246 313.1670 399.4209 403.2427 414.4888 429.8775 439.9100 497.3374 512.7110 548.1685 618.7580 699.9180 787.5286 833.7906 859.8224 872.6659 888.4197 915.8581 921.5788 948.0910 957.6646 986.1177 998.6610 1008.5636 1020.9235 1040.5117 1047.5771 1073.3211 1091.4097 1098.6461 1149.5335 1161.6919 1186.6184 1190.1197 1227.1212 1260.1234 1274.8749 1288.8542 1305.1686 1316.6896 1329.5857 1344.6602 1359.9242 1380.2310 1381.5349 1388.9731 1392.7483 1426.7477 1450.8757 1458.9943 1460.4281 1470.6682 1472.5064 1473.7370 1473.9808 1480.1587 1485.0959 1663.1204 1696.7081 2931.1475 2931.3389 2946.3919 2954.6669 2959.2514 2964.6306 2968.5312 2971.6871 2989.3084 3024.2337 3032.5672 3055.7565 3065.3251 3072.9887 3075.7629 3078.2433 3079.3902 3079.9762 3087.3751 3184.9824
redmass: 3.0009 2.8990 2.1487 2.2385 2.6681 1.2396 1.2784 1.4151 1.0751 2.1052 1.4903 2.3791 3.0005 2.8444 2.3038 2.1060 3.6473 2.8871 2.9671 2.5580 2.4909 3.2401 1.1190 1.9259 1.5721 2.2038 1.9012 2.1143 1.7659 1.3559 1.8537 1.5905 1.9162 1.3955 1.5133 1.5632 1.4792 1.7758 1.9772 2.3705 2.2036 1.8686 1.9740 1.9208 1.5041 1.7807 1.4080 1.3179 1.4751 1.6185 1.4302 1.4069 1.6398 2.0827 1.2171 1.2245 1.2211 1.2410 1.1809 1.0840 1.0489 1.0487 1.0641 1.0554 1.0572 1.0562 1.0467 1.0488 4.6886 7.0962 1.0645 1.0784 1.0819 1.0378 1.0397 1.0651 1.0524 1.0360 1.0947 1.0965 1.0964 1.0986 1.0993 1.0963 1.0988 1.0930 1.0979 1.0985 1.0626 1.1136
irintensity: 0.0805 0.3060 0.2936 1.1390 0.0568 0.1417 0.1979 0.3575 0.1052 0.1730 0.2278 0.6959 0.1207 1.2454 4.0552 2.1555 0.8852 0.2561 0.7278 1.5067 4.9409 1.4812 0.1915 7.3957 5.0588 2.8706 2.3032 3.8529 3.8230 65.4646 5.2897 4.0550 1.5607 1.4714 5.7539 3.8719 0.8168 4.7232 2.1206 1.7463 1.8913 10.7177 0.4547 5.0581 0.9284 9.2115 2.1443 0.5347 1.5379 1.1680 0.6956 1.4054 15.2417 8.5926 20.0890 10.5039 26.5995 11.3741 2.1131 4.6239 11.2812 13.0944 10.4273 30.8551 3.6143 1.8298 7.8822 7.3333 24.8804 3.1638 24.2805 10.3134 12.2582 57.0057 22.1422 14.6547 68.5285 31.5192 46.6341 30.2760 25.7531 48.2106 34.2893 3.9149 20.3079 91.6823 20.1885 42.6582 6.1198 29.7811
temp: 298.150 k
press: 1.00000 atm
elementType: 6 6 6 6 6 6 6 6 6 6 6 6 1 1 1 1 1 1 1 1 1 1 1 1 1 1 1 1 1 1 1 1
symmnumber: 1
zpe: 748739.8 jmol-1
zpe.correction: 0.285180 hartree
zpe.thermalcorrener: 0.299089 hartree
zpe.thermalcorrenthalpy: 0.300033 hartree
zpe.thermalcorrgfe: 0.245840 hartree
zpe.sumelectzpe: -468.293401 hartree
zpe.sumelectthermal: -468.279492 hartree
zpe.sumelectthermalent: -468.278548 hartree
zpe.sumelectthermalfe: -468.332741 hartree
dipole: 0.2341 -0.3778 -0.4575
dipole: 0.6378
quadrupole: -74.1244 -76.5590 -75.7539
quadrupole: -0.6859 1.0374 0.5122
quadrupole: 1.3547 -1.0799 -0.2749 -0.6859 1.0374 0.5122
hfenergy: -468.5785812 hartree
pointgroup: C01 [X(C12H20)]
dipole: -0.09018 0.1441889 -0.1845185 debye
polarizability: 145.5997416|-6.9740485|125.471764|5.9611064|-4.4009113|107.5866016 unknown
InChI: InChI=1S/C12H20/c1-8(2)12-10(4)6-9(3)7-11(12)5/h6,10-12H,1,7H2,2-5H3
charge 0 multiplicity 1
32 atoms
C  0.621366 -0.038634 -0.228432
C  -0.067519 1.277324 0.261666
C  -0.119051 -1.290488 0.341896
C  -1.541073 1.316904 -0.213788
C  -2.292407 0.008185 -0.021857
C  -1.630068 -1.150772 0.241373
C  2.124448 -0.068885 0.093037
C  0.674865 2.550536 -0.199467
C  0.352799 -2.592206 -0.356838
C  -3.802267 0.073252 -0.148546
C  3.065886 0.004176 -1.095669
C  2.595031 -0.142095 1.367642
H  0.504402 -0.069037 -1.334698
H  -0.062697 1.253196 1.372271
H  0.1529 -1.379672 1.416909
H  -1.575129 1.604555 -1.288564
H  -2.074485 2.129353 0.323669
H  -2.208922 -2.076622 0.383664
H  1.696582 2.595115 0.216258
H  0.748082 2.5854 -1.30439
H  0.133801 3.458647 0.127443
H  0.11239 -2.565047 -1.436599
H  1.443432 -2.727543 -0.242521
H  -0.147712 -3.477872 0.077343
H  -4.267528 -0.922659 -0.045031
H  -4.101759 0.49076 -1.131134
H  -4.241055 0.738896 0.621833
H  2.882982 -0.837785 -1.792685
H  2.89606 0.933888 -1.674115
H  4.126287 -0.023395 -0.789298
H  3.670255 -0.153419 1.581129
H  1.926204 -0.192257 2.235399
