program: Gaussian 09
title: 000108634
version: EM64L-G09RevD.01
frameworkgroup: C1[X(C18H33N2O5)]
method: RPBEPBE
basis: SDD
operation: Freq
keyword: #p
keyword: freq=noraman
keyword: PBEPBE/SDD
title: #p freq=noraman PBEPBE/SDD
converged: YES YES NO NO
title: Mulliken charges:
elementType: O O O O O N N C C C C C C C C C C C C C C C C C C H H H H H H H H H H H H H H H H H H H H H H H H H H H H H H H H H
charge: -0.278232 -0.386809 -0.207433 -0.377574 -0.264807 -0.212639 0.043259 -0.391636 0.230007 -0.357235 -0.490139 -0.504262 -0.484855 -0.380266 -0.290329 -0.378675 0.179725 -0.388389 -0.384676 -0.372765 -0.354524 -0.348495 -0.355879 -0.692246 0.226561 0.294492 0.325237 0.260895 0.289720 0.388523 0.293624 0.287442 0.262526 0.265641 0.234157 0.219149 0.241652 0.247423 0.245520 0.193719 0.198887 0.203744 0.201168 0.194848 0.196188 0.192931 0.193393 0.189127 0.189634 0.415895 0.294504 0.259307 0.196074 0.196447 0.209917 0.221824 0.210412 0.408297
chargesum: 1.00000
title: Mulliken charges with hydrogens summed into heavy atoms:
elementType: O O O O O N N C C C C C C C C C C C C C C C C C C
charge: -0.278232 0.029086 -0.207433 0.030723 -0.264807 -0.212639 0.043259 0.228092 0.230007 0.193379 0.192007 0.045705 0.014943 0.080534 0.202614 0.013931 0.179725 0.016523 0.006359 0.013559 0.024238 0.205316 0.036642 -0.050093 0.226561
polarizability: 2.84251293e+02 -5.05960695e+00 1.96214503e+02 -7.06938209e+00 -8.95438834e+00 1.93096906e+02
1716.lowfreq: -5.7855 -4.3960 -0.0013 0.0008 0.0013 4.8864 9.9501 15.6738 24.6430
frequency: 9.0661 15.6104 24.3714 29.6254 38.2520 44.7724 56.8488 61.0458 62.8969 74.7970 76.2187 94.8382 98.5078 105.4369 109.2940 134.0507 135.5516 145.7387 151.2935 169.9267 180.3571 201.3163 231.9006 240.7205 248.8455 252.5261 266.8353 293.4680 302.2264 314.9833 347.6862 368.0095 374.4886 405.8549 445.1683 471.9127 482.5855 498.3370 526.8859 533.2538 547.5664 587.3965 609.0500 637.2754 647.5799 650.9768 655.5617 710.7778 721.3031 723.5955 733.4595 743.2298 765.6244 804.9797 816.1332 838.0291 847.9852 856.8071 878.6339 889.3914 900.6942 922.5358 949.0619 963.9865 973.5160 990.2282 996.2276 1004.7607 1013.0042 1014.7412 1023.4131 1037.3475 1045.5547 1053.9406 1057.4615 1067.9288 1069.9898 1078.1108 1081.4266 1084.2080 1096.5085 1104.6479 1119.5712 1122.1214 1135.1401 1184.4440 1205.8351 1211.5358 1215.1192 1218.6071 1225.6243 1240.8580 1248.1821 1248.6728 1258.3410 1275.2058 1278.6935 1280.9463 1281.6217 1287.5273 1295.8809 1297.2134 1298.4506 1308.8531 1318.8091 1322.5077 1337.6765 1348.8390 1350.7148 1355.7867 1356.8355 1364.3091 1372.0881 1390.5860 1391.6817 1402.3790 1435.7790 1437.3478 1451.1750 1454.7008 1460.0311 1460.8949 1463.8656 1466.8532 1467.5907 1472.8347 1478.1502 1479.1183 1482.5286 1484.9184 1487.1921 1488.6923 1646.2290 1664.6172 1731.1383 2951.3742 2952.1906 2953.1992 2954.8778 2957.8296 2964.3963 2965.0256 2969.6080 2970.1472 2974.2624 2985.7750 2991.7036 2992.5126 2998.4133 3001.8041 3009.1836 3014.3468 3029.0048 3029.4533 3030.4745 3039.3482 3041.9095 3069.8094 3070.1580 3074.3332 3075.7024 3078.7276 3093.2094 3095.6024 3105.7621 3160.4954 3512.7682 3517.8903
redmass: 5.0734 5.6632 2.0553 4.8104 2.5188 7.2899 6.6433 1.9253 7.1682 4.5620 3.5979 2.4555 4.8106 3.9367 1.9086 3.9365 3.5094 1.9357 2.6769 3.4200 3.4300 3.6823 1.1144 2.8337 2.5835 3.8854 4.8080 3.4817 3.5813 4.2879 2.6185 2.8848 3.5986 3.0411 3.6096 3.3186 2.9595 2.0504 2.1442 3.1157 3.1431 3.9628 4.7834 2.3615 1.7266 1.5110 3.7286 3.4401 1.0622 1.0846 1.1695 2.4512 1.1957 2.9732 1.2902 3.8440 3.4552 2.2718 1.3373 1.9270 2.8942 2.6987 1.2555 2.6365 2.6691 4.8391 3.3125 2.5356 1.1907 2.5263 2.8693 3.5792 2.7105 2.4129 3.0692 2.7068 2.2574 2.3253 2.2402 2.6854 2.0896 3.3630 1.8887 2.1817 2.3499 1.7824 1.1410 1.2921 1.4289 1.1179 1.1773 1.2495 1.3164 1.3124 1.2257 1.1510 1.5820 1.3505 1.0670 1.0667 1.6133 1.1060 1.1301 1.3228 1.3295 1.2419 1.4049 1.2794 1.5036 1.6438 1.5939 1.6838 1.3313 1.4559 1.2153 1.4470 1.0935 1.0969 1.0826 1.0844 1.0738 1.0733 1.0647 1.0796 1.0799 1.0788 1.0451 1.0797 1.0841 1.0901 1.0818 1.0932 8.5942 8.5540 9.9608 1.0586 1.0589 1.0590 1.0704 1.0594 1.0587 1.0591 1.0590 1.0614 1.0362 1.0967 1.0976 1.0660 1.0839 1.0819 1.0945 1.1035 1.0654 1.1046 1.0827 1.0769 1.1047 1.1013 1.1031 1.0932 1.0992 1.0612 1.0966 1.1002 1.1058 1.1102 1.0648 1.0648
irintensity: 0.2375 0.7792 0.0672 0.9735 0.4395 0.8776 1.0495 0.0787 0.9331 0.4938 0.8485 0.1566 4.5040 0.7105 0.0576 1.7950 1.5966 0.0214 0.1195 2.9429 1.8881 4.6152 0.0237 13.6866 0.6474 3.2536 7.8058 5.1348 4.2964 3.8283 4.7519 7.0503 4.3696 4.3187 1.7237 34.5053 30.7823 27.2284 30.1248 5.7789 9.4583 49.7451 32.6763 11.0817 176.4432 150.9722 18.4054 37.4873 17.3003 0.8238 1.7838 26.0912 1.1716 3.7083 1.9974 21.4203 42.9725 17.2076 1.6717 7.6519 47.1432 3.0732 2.2768 7.2474 25.4587 1.0770 11.5157 25.2631 5.9043 42.5149 72.4565 19.7496 46.6288 365.7775 0.5542 3.6904 99.8586 0.4556 2.0263 13.7349 5.3969 14.1318 16.0074 15.2267 15.6117 0.1780 2.5542 26.7989 3.0636 8.8507 2.6071 5.3952 7.2343 2.3399 2.0658 1.1228 37.4622 2.3185 1.0334 0.7762 14.2957 1.2616 0.5717 8.6700 6.7356 5.4836 3.0754 12.7110 4.2340 0.1000 0.3127 20.3561 4.9705 38.8966 11.3525 29.8944 43.0152 16.2330 23.9423 39.2585 0.8072 0.0985 2.0426 0.0470 12.8155 4.1222 12.7176 2.2882 14.5753 4.8212 5.3050 31.5976 372.6556 155.1221 72.6935 0.6339 0.6456 5.8502 217.0981 2.0797 8.6152 35.7253 151.0646 30.6439 38.0549 0.4382 1.4862 21.7506 9.9330 11.7382 7.8104 1.5582 5.3994 0.3969 12.3498 13.7573 139.8155 30.2946 107.1550 17.3766 48.6620 8.1872 1.8063 2.2446 3.7262 10.5759 72.1135 94.3542
temp: 298.150 k
press: 1.00000 atm
elementType: 8 8 8 8 8 7 7 6 6 6 6 6 6 6 6 6 6 6 6 6 6 6 6 6 6 1 1 1 1 1 1 1 1 1 1 1 1 1 1 1 1 1 1 1 1 1 1 1 1 1 1 1 1 1 1 1 1 1
symmnumber: 1
zpe: 1307014.5 jmol-1
zpe.correction: 0.497816 hartree
zpe.thermalcorrener: 0.527099 hartree
zpe.thermalcorrenthalpy: 0.528044 hartree
zpe.thermalcorrgfe: 0.432349 hartree
zpe.sumelectzpe: -1189.070148 hartree
zpe.sumelectthermal: -1189.040864 hartree
zpe.sumelectthermalent: -1189.039920 hartree
zpe.sumelectthermalfe: -1189.135615 hartree
dipole: 13.2352 -0.7865 -2.3256
dipole: 13.4610
quadrupole: -61.7275 -129.2093 -140.6748
quadrupole: -2.2361 -9.2326 1.8012
quadrupole: 48.8097 -18.6721 -30.1376 -2.2361 -9.2326 1.8012
hfenergy: -1189.5679635 hartree
pointgroup: C01 [X(C18H33N2O5)]
dipole: -5.2461742 -0.536707 0.4866672 debye
polarizability: 284.8739659|3.4196965|186.0041223|-1.4383154|4.3341001|202.6846142 unknown
InChI: InChI=1S/C18H33N2O5/c1-2-3-4-5-6-7-8-9-16-19-10-11-20(16,14-17(21)22)12-13-25-15-18(23)24/h21,23H,2-15H2,1H3
charge 1 multiplicity 1
58 atoms
O  -4.907468 -1.201356 -0.654754
O  -2.105404 2.925101 2.045213
O  -1.544579 3.06393 -0.212634
O  -7.757077 -0.16656 1.408665
O  -5.603943 0.703056 1.300308
N  -2.223851 0.271975 -0.554552
N  -0.647986 0.599497 -2.348971
C  -2.996285 0.868549 -1.75326
C  -0.681362 0.395705 -1.088852
C  -2.489981 -1.245696 -0.417339
C  -2.491057 0.983707 0.758356
C  -1.999583 0.748757 -2.941874
C  0.436126 0.227131 -0.104573
C  1.811589 0.030883 -0.793335
C  -3.819359 -1.645411 0.225306
C  2.962615 -0.055978 0.232512
C  -1.985454 2.423255 0.764213
C  4.334443 -0.279138 -0.444265
C  5.510445 -0.313971 0.557558
C  6.876592 -0.553292 -0.12432
C  8.062837 -0.559091 0.865937
C  -6.234046 -1.273645 -0.06099
C  9.426258 -0.804931 0.179762
C  10.609146 -0.798714 1.171555
C  -6.461901 -0.137745 0.942751
H  -3.19557 1.92304 -1.520963
H  -3.933222 0.309985 -1.877051
H  -1.666799 -1.667457 0.185026
H  -2.423824 -1.660177 -1.437237
H  -3.583651 0.982913 0.950932
H  -2.000657 0.428178 1.575798
H  -2.015825 1.647782 -3.578461
H  -2.198208 -0.12214 -3.592349
H  0.484506 1.129619 0.539303
H  0.234638 -0.625167 0.576418
H  1.783287 -0.886595 -1.4119
H  1.987187 0.871255 -1.489427
H  -3.821907 -2.752835 0.306102
H  -3.933176 -1.225338 1.242697
H  2.771299 -0.881929 0.949617
H  2.99985 0.878555 0.83042
H  4.51219 0.526599 -1.18625
H  4.311998 -1.229816 -1.016365
H  5.33306 -1.110085 1.31073
H  5.544844 0.643472 1.118195
H  6.850494 -1.51989 -0.669692
H  7.045963 0.231279 -0.891278
H  7.897095 -1.339761 1.637828
H  8.096615 0.409989 1.406571
H  -1.826079 3.88044 2.090765
H  -6.953421 -1.173408 -0.890122
H  -6.424924 -2.246094 0.436401
H  9.395118 -1.7763 -0.354847
H  9.588566 -0.028748 -0.595807
H  10.486874 -1.583883 1.941433
H  11.569887 -0.97928 0.65611
H  10.684702 0.173599 1.693976
H  -7.938228 0.56568 2.05941
