program: Gaussian 09
title: 000106245
version: EM64L-G09RevD.01
frameworkgroup: C1[X(C6H10N4O4)]
method: RPBEPBE
basis: SDD
operation: Freq
keyword: #p
keyword: freq=noraman
keyword: PBEPBE/SDD
title: #p freq=noraman PBEPBE/SDD
converged: YES YES NO NO
title: Mulliken charges:
elementType: O O O O N N N N C C C C C C H H H H H H H H H H
charge: -0.281386 -0.437172 -0.436859 -0.253026 -0.171065 -0.170997 -0.391907 -0.391295 -0.113312 -0.113802 0.289675 0.210235 -0.327247 -0.326580 0.288401 0.288417 0.336699 0.336212 0.252715 0.228756 0.228389 0.252797 0.351254 0.351097
chargesum: 0.00000
title: Mulliken charges with hydrogens summed into heavy atoms:
elementType: O O O O N N N N C C C C C C
charge: -0.281386 -0.085918 -0.085762 -0.253026 -0.171065 -0.170997 -0.055209 -0.055082 0.175089 0.174615 0.289675 0.210235 0.154223 0.154606
polarizability: 1.19865499e+02 -1.32787993e-01 1.10613834e+02 -1.66188329e+00 1.13409717e-01 7.37833317e+01
1716.lowfreq: -7.7755 -0.0008 -0.0007 -0.0006 11.8713 14.2676 36.4453 41.2590 58.9977
frequency: 36.3073 41.1974 58.9766 78.4603 95.8110 109.6769 165.6101 235.6494 247.3515 312.0224 339.0615 354.0666 376.3247 399.1752 417.8536 468.3378 475.5123 535.9492 570.0706 644.1785 647.9406 687.7716 699.4826 727.8093 760.2716 836.0874 873.4619 908.8102 925.5884 937.9779 954.8584 980.6062 1007.5634 1069.9921 1099.7743 1107.9458 1122.3091 1204.0157 1225.2195 1230.7917 1263.1257 1268.0781 1297.9809 1331.7369 1332.5878 1345.2124 1365.8687 1383.2628 1393.0804 1396.9385 1399.5784 1428.1783 1451.1974 1453.4516 1660.8592 1708.5854 3021.7006 3022.4537 3023.2293 3037.9694 3097.5085 3098.7504 3563.9077 3564.5838 3626.5342 3629.9951
redmass: 4.9280 6.6809 4.2121 5.4991 11.7894 6.1713 10.4266 3.2723 2.1195 3.6908 3.7173 1.4947 1.2230 1.2770 3.0408 4.3147 1.2169 6.5518 4.6923 6.5769 3.8546 8.8639 11.4433 7.5052 6.1409 6.3376 2.2956 6.1266 6.1843 2.3880 3.7275 1.8413 2.4136 2.5891 2.0598 2.2099 2.2881 1.6915 2.2354 2.2976 1.7369 3.2615 1.9319 1.2622 1.2846 1.4896 1.3707 1.3680 1.6130 1.4475 1.2417 2.4527 1.0829 1.1053 9.9459 7.7193 1.0591 1.0594 1.0869 1.0871 1.1071 1.1067 1.0664 1.0664 1.0784 1.0815
irintensity: 1.8573 2.1127 0.0436 7.0041 5.1166 6.3754 6.5014 6.5759 8.1945 44.0531 44.3270 5.3078 148.4283 117.0894 1.6558 48.3385 255.5482 12.4945 62.7673 26.2840 0.4245 8.7138 3.4830 47.9546 33.4407 95.5368 6.7894 129.7886 271.9595 17.5317 0.1277 85.4116 8.2522 46.7704 146.6691 23.6149 21.3270 76.6889 234.0401 64.9577 0.8209 81.6152 28.5727 63.5923 73.6118 0.5322 7.3182 15.0701 5.1013 115.9143 32.4773 297.8492 28.4579 58.6070 416.5146 547.2123 27.0590 36.8146 1.3270 38.1956 11.4035 12.0990 7.5486 11.6028 97.0564 14.5250
temp: 298.150 k
press: 1.00000 atm
elementType: 8 8 8 8 7 7 7 7 6 6 6 6 6 6 1 1 1 1 1 1 1 1 1 1
symmnumber: 1
zpe: 479321.1 jmol-1
zpe.correction: 0.182564 hartree
zpe.thermalcorrener: 0.196084 hartree
zpe.thermalcorrenthalpy: 0.197028 hartree
zpe.thermalcorrgfe: 0.140796 hartree
zpe.sumelectzpe: -753.491494 hartree
zpe.sumelectthermal: -753.477973 hartree
zpe.sumelectthermalent: -753.477029 hartree
zpe.sumelectthermalfe: -753.533262 hartree
dipole: -2.1745 0.0412 2.5192
dipole: 3.3281
quadrupole: -97.4662 -81.6928 -84.0661
quadrupole: 0.3620 0.2831 0.0654
quadrupole: -9.7245 6.0489 3.6756 0.3620 0.2831 0.0654
hfenergy: -753.6740577 hartree
pointgroup: C01 [X(C6H10N4O4)]
dipole: -0.7904064 -0.1313795 1.0356159 debye
dipolederiv: -1.0569243 -0.0719953 -0.3948617 -0.0716031 -0.6034085 -0.0606486 -0.4163938 -0.065198 -0.5634922 -0.5113082 0.4568881 0.1254767 0.376492 -0.6457881 -0.006714 0.2374613 -0.2605168 -0.6781225 -0.2829719 -0.3411189 0.1147192 -0.2622464 -0.8723024 0.0461714 0.1451044 0.3218999 -0.6793937 -1.3167163 -0.1280132 0.3349768 -0.128764 -0.540217 0.0520695 0.44335 0.0693271 -0.5176327 -0.9339311 -0.056493 -0.02132 0.0812546 -1.4567167 -0.218816 -0.2235865 -0.121023 -0.5111617 -0.972523 0.2046855 -0.0853287 0.0713985 -1.4170861 0.2055214 -0.250346 0.0505541 -0.5106765 -1.1340931 0.2587441 0.0613523 0.2392299 -0.6065182 -0.0800696 0.2152361 -0.0970633 -0.6022339 -0.94112 -0.3701096 0.0314307 -0.3515832 -0.8057308 0.088506 0.1709985 0.1500156 -0.5963956 1.2291292 0.1086216 0.0160922 0.2483362 0.0434663 -0.0584229 0.0538061 0.0389772 0.5906401 1.2237801 0.2708499 -0.0074548 0.1290609 0.0490578 0.0539981 0.0557603 -0.0281206 0.5896636 1.2930569 -0.0719484 0.6740052 -0.0726463 1.7494221 0.1038417 0.6636818 0.1032715 0.5940124 1.8434952 0.0732606 -0.6090407 0.0749448 1.434079 -0.0849663 -0.7966981 -0.1142134 0.5814695 0.6244423 -0.5820092 -0.3127908 -0.5012843 1.116523 0.1194232 -0.3496295 0.1369027 0.6204397 0.3555979 0.341543 -0.2607484 0.2602617 1.3839434 -0.2095749 -0.2904537 -0.2379147 0.6230773 -0.0490513 -0.0113987 0.0328359 -0.0357523 0.0653006 -0.066977 0.0048744 -0.0509418 -0.0825897 -0.0522253 -0.0256409 0.0093562 0.0005139 0.0671033 0.0752374 -0.0095903 0.0519626 -0.0810702 0.205371 0.0132143 0.0813897 0.0116642 0.2072203 -0.0029114 0.1331414 -0.0052974 0.3246731 0.2126988 -0.0114693 0.076857 -0.0114344 0.1985716 0.0257502 0.1240667 0.045839 0.3244536 -0.0065222 0.063195 -0.0553035 -0.0012514 0.0971418 -0.0765025 -0.0286415 -0.0167113 -0.045746 0.0016383 -0.0906201 0.0980299 -0.0398536 -0.0781228 0.0331735 0.0677372 -0.0292782 0.052204 -0.0428393 0.1015595 0.104266 0.0507514 -0.0341414 -0.0023439 0.0563919 0.0473043 0.0511887 0.0200652 -0.0871472 -0.075996 -0.0224253 0.0702262 0.0562738 -0.0328046 0.0073513 -0.0448474 0.2012481 -0.1822479 0.0316 -0.2183268 0.2330667 -0.0038433 0.0155352 -0.0181909 0.2809656 0.0897029 0.1376498 0.0304566 0.1732629 0.3449097 0.0118242 0.0109988 0.021064 0.2805744 unknown
polarizability: 119.3024663|1.486182|110.8658666|-4.0846955|-0.5687941|74.0943316 unknown
InChI: InChI=1S/C6H10N4O4/c11-1-9-3-4(8-5(13)7-3)10(2-12)6(9)14/h3-4,7-8,11-12H,1-2H2
charge 0 multiplicity 1
24 atoms
O  -2.414363 -0.376152 -1.184355
O  -2.06184 2.814823 0.911471
O  -1.110623 -3.313751 0.915892
O  3.704777 0.586555 -0.874096
N  -0.792167 1.01718 -0.137095
N  -0.44853 -1.216789 -0.136323
N  1.658189 1.393846 0.041172
N  2.001049 -0.822658 0.014575
C  0.443963 0.868206 0.654749
C  0.690859 -0.70225 0.645923
C  -1.330497 -0.209177 -0.560901
C  2.580164 0.406164 -0.347187
C  -1.47417 2.282151 -0.325486
C  -0.71846 -2.628702 -0.323432
H  0.287241 1.287786 1.663673
H  0.683307 -1.159189 1.650731
H  1.898397 2.38028 -0.011717
H  2.530768 -1.687624 -0.055252
H  -2.23341 2.124763 -1.113551
H  -0.759042 3.061399 -0.633052
H  0.196006 -3.156912 -0.636611
H  -1.494568 -2.707295 -1.106864
H  -2.878514 2.299816 1.134518
H  -2.042339 -3.066968 1.145917
