program: Gaussian 09
title: 000106270
version: EM64L-G09RevD.01
frameworkgroup: C1[X(C13H11ClN2O4S)]
method: RPBEPBE
basis: SDD
operation: Freq
keyword: #p
keyword: freq=noraman
keyword: PBEPBE/SDD
title: #p freq=noraman PBEPBE/SDD
converged: YES YES NO NO
title: Mulliken charges:
elementType: Cl S O O O O N N C C C C C C C C C C C C C H H H H H H H H H H H
charge: -0.051991 0.985858 -0.561558 -0.495623 -0.534728 -0.245257 -0.488892 -0.700490 -0.348999 0.599236 0.617989 -0.646221 -0.192918 -0.381225 0.277464 0.138658 -0.328891 -0.352768 -0.104125 -0.200686 -0.223316 0.222599 0.276473 0.319666 0.319808 0.313041 0.370090 0.248333 0.280616 0.243475 0.264391 0.379992
chargesum: 0.00000
title: Mulliken charges with hydrogens summed into heavy atoms:
elementType: Cl S O O O O N N C C C C C C C C C C C C C
charge: -0.051991 0.985858 -0.181566 -0.495623 -0.534728 -0.245257 -0.169084 -0.017359 -0.348999 0.599236 0.617989 -0.423622 0.083555 -0.061559 0.277464 0.138658 -0.080558 -0.072153 -0.104125 0.042788 0.041075
polarizability: 3.61394685e+02 7.18417404e+00 2.18714958e+02 6.85019741e+00 -3.27859279e+00 1.04860353e+02
1716.lowfreq: -5.6939 -0.0022 0.0019 0.0022 1.7154 3.2180 15.9684 28.3179 45.4806
frequency: 15.8229 28.3008 45.4684 47.4653 68.8449 94.0400 114.3063 146.6530 169.3978 177.0621 188.7951 197.4605 203.3426 238.6114 270.3803 285.3380 298.5396 311.5584 324.6991 333.8247 364.7066 373.8708 412.4708 420.6735 445.2468 454.4078 465.2395 499.7350 514.0347 538.8445 554.3130 621.7832 626.4931 653.1346 669.6255 680.7829 689.0710 711.5436 728.3904 743.1647 775.8517 809.7055 813.4760 834.7523 872.1606 877.4009 884.1695 931.4160 942.7904 961.5741 983.6841 985.7771 990.4981 996.4657 1043.4821 1062.9868 1078.6955 1095.1397 1115.9830 1158.2440 1177.6117 1225.7201 1247.1979 1281.8499 1293.4816 1333.5834 1379.6333 1400.9790 1409.6158 1421.9605 1463.9616 1482.5608 1530.6998 1566.4747 1578.6179 1603.9333 1610.4235 1627.7447 1649.2608 3114.6080 3146.7282 3149.9873 3155.6212 3170.5916 3181.3567 3215.6790 3398.7946 3476.7950 3530.0716 3652.2009
redmass: 8.4414 6.6828 8.6282 5.9939 7.2565 6.8335 9.7869 6.0889 1.7433 5.7985 5.7489 5.9842 5.9879 4.8926 3.0451 6.8889 5.4129 7.8579 7.4796 9.7100 5.4124 7.8964 6.9437 3.6358 1.2656 3.7318 3.5888 4.0144 5.7742 9.3210 8.0635 5.5996 1.8794 6.7504 2.8622 2.2837 1.2077 5.8946 3.2053 1.9418 6.3964 1.5280 10.9019 1.4130 3.0995 2.3803 2.0479 1.3950 7.4716 4.1001 5.8312 1.3375 6.7505 1.3623 1.1857 2.5013 1.8631 1.5759 1.9894 1.2297 1.0846 2.1733 2.0443 1.5338 1.2991 2.9977 9.1103 7.2469 2.8770 2.8488 2.4963 3.0732 2.8433 6.5591 4.3328 6.0752 5.8112 2.8888 1.5261 1.0912 1.0918 1.0878 1.0914 1.0930 1.0990 1.0949 1.0589 1.0660 1.0760 1.0925
irintensity: 1.4051 0.6733 1.5672 2.3367 1.9462 4.0086 1.1498 1.4936 45.6703 3.5468 1.6503 2.3571 5.4314 2.4536 61.0903 24.1426 3.5730 2.7425 9.9269 12.4337 8.8838 2.8145 44.5736 2.3332 120.7349 5.3235 9.8219 18.3121 9.1721 121.9435 62.3517 79.0208 32.6422 9.3063 4.3927 6.4125 195.2330 51.6597 48.2644 6.7634 12.3053 37.9138 96.5336 10.5227 8.5518 110.5668 28.8173 1.3167 67.4379 16.5321 5.0621 2.2869 25.3471 2.2019 112.7230 36.2466 14.4989 14.1302 6.4701 12.7911 6.7836 21.5649 245.8178 6.5331 0.8447 221.0682 0.8717 219.1503 23.7962 208.2627 29.4729 140.9850 317.3874 124.2409 40.6913 4.7611 97.9378 167.4315 369.5393 12.9715 4.9983 6.4889 4.0018 0.5228 7.3412 16.4671 153.8054 40.8620 12.1252 56.7886
temp: 298.150 k
press: 1.00000 atm
elementType: 17 16 8 8 8 8 7 7 6 6 6 6 6 6 6 6 6 6 6 6 6 1 1 1 1 1 1 1 1 1 1 1
symmnumber: 1
zpe: 582697.7 jmol-1
zpe.correction: 0.221938 hartree
zpe.thermalcorrener: 0.242085 hartree
zpe.thermalcorrenthalpy: 0.243029 hartree
zpe.thermalcorrgfe: 0.171091 hartree
zpe.sumelectzpe: -1768.853030 hartree
zpe.sumelectthermal: -1768.832882 hartree
zpe.sumelectthermalent: -1768.831938 hartree
zpe.sumelectthermalfe: -1768.903877 hartree
dipole: -5.1116 3.2709 -0.8137
dipole: 6.1229
quadrupole: -143.8152 -133.7245 -140.4731
quadrupole: 15.2150 13.9128 -2.3781
quadrupole: -4.4776 5.6131 -1.1355 15.2150 13.9128 -2.3781
hfenergy: -1769.0749676 hartree
pointgroup: C01 [X(C13H11Cl1N2O4S1)]
dipole: 1.8827964 -1.0857179 1.0388609 debye
polarizability: 359.6195433|-22.4065962|136.39984|-8.5797599|-49.3549196|188.950612 unknown
InChI: InChI=1S/C13H11ClN2O4S/c14-9-3-1-2-8(6-9)13(17)16-10-4-5-12(11(15)7-10)21(18,19)20/h1-7,16,18H,15H2
charge 0 multiplicity 1
32 atoms
Cl 5.452557 -1.458922 2.672696
S  -5.214497 0.313575 0.011139
O  -5.233473 1.639191 1.322319
O  -5.728491 0.972212 -1.371859
O  -6.003881 -0.97708 0.625542
O  1.500193 0.98872 -1.796823
N  0.787646 -0.430726 -0.061423
N  -3.530336 -1.747088 1.721256
C  -3.398048 0.013786 -0.010658
C  -0.619267 -0.247727 -0.088927
C  -2.801096 -0.947994 0.867105
C  -1.381108 -1.048044 0.792398
C  -2.648099 0.812591 -0.895559
C  -1.254407 0.688071 -0.958941
C  3.18841 -0.179677 -0.510179
C  1.764869 0.189798 -0.850034
C  3.588437 -0.613256 0.781719
C  4.159135 -0.039526 -1.53428
C  4.9434 -0.917142 1.00718
C  5.509409 -0.354775 -1.281679
C  5.917393 -0.803136 -0.002881
H  -0.880681 -1.77582 1.444391
H  -3.169901 1.522341 -1.545983
H  -0.658583 1.284134 -1.648746
H  1.123251 -1.139593 0.594423
H  -3.057255 -2.407407 2.33185
H  -4.556763 -1.73814 1.672645
H  2.88577 -0.667188 1.62011
H  3.832272 0.324825 -2.512717
H  6.254797 -0.25251 -2.076764
H  6.963244 -1.046469 0.204188
H  -6.176997 1.967671 1.397993
