program: Gaussian 09
title: 000108307
version: EM64L-G09RevD.01
frameworkgroup: C1[X(C18H19N2O4S)]
method: RPBEPBE
basis: SDD
operation: Freq
keyword: #p
keyword: freq=noraman
keyword: PBEPBE/SDD
title: #p freq=noraman PBEPBE/SDD
converged: YES YES NO NO
title: Mulliken charges:
elementType: S O O O O N N C C C C C C C C C C C C C C C C C C H H H H H H H H H H H H H H H H H H H
charge: 1.055437 -0.246911 -0.582405 -0.559945 -0.465045 -0.228791 -0.394302 -0.429103 -0.393403 0.299826 -0.585199 0.436698 0.209532 -0.339395 -0.335974 -0.429877 -0.203020 -0.202468 -0.090796 0.521132 -0.417917 -0.346691 -0.184889 -0.207043 -0.233575 0.249516 0.302318 0.284145 0.270920 0.323870 0.313996 0.254085 0.276508 0.317051 0.254302 0.260052 0.266087 0.403012 0.352017 0.240562 0.233317 0.251052 0.247126 0.254188
chargesum: 1.00000
title: Mulliken charges with hydrogens summed into heavy atoms:
elementType: S O O O O N N C C C C C C C C C C C C C C C C C C
charge: 1.055437 -0.246911 -0.179392 -0.559945 -0.465045 -0.228791 -0.042285 0.122730 0.161662 0.299826 0.052667 0.436698 0.209532 -0.085311 -0.059467 -0.112827 0.051282 0.057584 0.175291 0.521132 -0.177355 -0.113374 0.066163 0.040084 0.020613
polarizability: 5.29197808e+02 -4.08929253e+01 2.87475925e+02 2.70571043e+00 8.95053196e-01 1.23197298e+02
1716.lowfreq: -7.8251 -4.3115 -0.0012 0.0009 0.0010 6.5614 16.2131 16.6677 27.0554
frequency: 16.0096 16.5352 26.7796 37.4368 42.0621 64.0994 77.1098 90.0781 100.6195 135.8629 167.8383 177.5903 190.1686 204.2939 211.1717 219.2204 238.7344 263.1332 273.1663 284.5658 298.1953 307.6832 314.9697 326.7068 353.9948 387.0478 399.8034 422.9851 431.6331 466.2953 492.2497 496.6307 504.8714 547.7480 557.2615 596.7229 604.0294 611.1955 620.4458 658.5867 686.4605 697.4110 722.8848 744.7018 758.6211 758.8455 767.7789 789.6222 819.3230 827.2760 828.9031 848.4848 855.0062 859.2830 888.1188 912.2909 920.5170 942.8533 956.4957 975.0308 980.1884 986.0310 991.8430 993.7202 1004.1197 1009.6543 1025.3243 1028.0115 1048.2387 1063.3803 1091.9685 1094.7314 1108.5522 1145.6066 1161.4143 1178.4221 1182.4446 1193.3396 1203.4101 1215.2502 1245.7877 1273.3425 1285.3959 1293.8323 1298.1729 1318.9751 1336.3874 1343.1553 1352.3499 1370.4500 1389.2289 1396.5808 1412.7553 1417.8351 1436.6141 1447.8857 1452.9480 1464.0696 1479.8775 1486.4678 1497.9075 1586.3405 1605.7360 1609.2883 1616.7560 1636.6360 1668.0077 2999.7348 3027.9029 3050.6069 3058.3240 3086.3334 3093.9004 3124.5262 3143.7943 3148.3958 3156.4183 3157.3728 3166.3049 3168.4213 3176.7494 3181.4818 3182.8890 3194.2970 3459.4070 3488.0147
redmass: 3.8693 6.9220 5.8338 5.5580 7.2115 6.0655 4.5543 5.4438 8.0425 5.2565 8.6212 3.7204 5.3027 3.7795 3.2603 2.1983 2.3065 4.0426 4.6375 5.1086 3.5501 3.0392 1.8309 5.9979 4.6342 4.7554 2.8094 3.5137 4.6409 4.9518 6.2278 6.0217 3.0726 7.9215 4.0197 5.7505 5.5758 6.2416 4.8934 7.2366 1.8587 5.5371 4.8030 2.9731 1.2544 1.5268 1.6346 1.4622 4.1978 5.2354 1.3083 2.7105 1.4642 3.5066 1.6505 1.4735 3.5648 1.3668 6.0480 1.3626 1.1596 5.7303 1.3248 2.2070 1.3321 2.0321 2.1938 1.6915 1.4163 4.4384 2.5897 1.6861 3.2956 1.5240 1.4260 1.2035 1.0620 1.1918 1.6036 2.0433 1.8364 1.3320 1.7371 1.3206 1.3831 1.6058 1.4079 1.3668 2.1361 2.8492 3.6340 1.5501 5.1058 1.1388 1.9154 1.1052 2.7302 2.5644 1.9165 2.0243 1.2283 4.9748 5.9951 7.5122 4.2425 5.9837 5.1045 1.0624 1.0622 1.0774 1.0786 1.0937 1.1032 1.0907 1.0875 1.1112 1.0908 1.0880 1.0960 1.0920 1.0927 1.0964 1.1013 1.0994 1.0766 1.0666
irintensity: 0.0737 0.9349 1.6570 1.2747 0.1382 0.6455 0.2427 0.8471 9.6952 0.3646 1.7928 3.2167 4.1845 5.6130 1.2806 14.0079 0.6932 2.7042 1.7009 8.9942 9.2423 36.4259 85.8561 17.9653 1.6468 13.2605 0.2353 9.6834 0.7549 9.3203 15.7181 6.6332 15.9176 94.6316 0.6154 4.6481 3.1174 1.3896 3.8139 1.7593 36.8137 32.8459 1.3057 17.0466 108.5718 14.9698 16.0871 86.3627 17.5798 24.3955 8.8358 7.2676 0.7205 7.8881 44.9421 6.7344 72.3756 2.3824 114.4260 10.7076 87.5535 5.5686 0.2951 19.7257 3.4346 10.2852 7.2035 54.8436 55.3350 8.8752 6.1741 6.3512 31.3498 12.9076 5.3381 1.8833 1.7628 17.8293 61.5922 4.9127 32.4505 8.3358 12.4428 3.1703 15.2414 219.4146 19.8579 87.9913 112.2173 84.8297 8.8754 29.9888 0.1953 16.1099 64.6068 20.7907 64.4857 19.3061 68.7816 53.2787 36.5304 20.6040 94.1957 67.0590 42.9979 122.2377 1616.8789 3.7210 8.5989 0.5076 1.5433 127.5233 15.4743 6.7875 6.1525 0.6372 0.9370 1.4446 12.6375 4.4238 0.2250 3.5418 13.4545 1.6485 101.6816 75.5273
temp: 298.150 k
press: 1.00000 atm
elementType: 16 8 8 8 8 7 7 6 6 6 6 6 6 6 6 6 6 6 6 6 6 6 6 6 6 1 1 1 1 1 1 1 1 1 1 1 1 1 1 1 1 1 1 1
symmnumber: 1
zpe: 892945.0 jmol-1
zpe.correction: 0.340105 hartree
zpe.thermalcorrener: 0.363832 hartree
zpe.thermalcorrenthalpy: 0.364777 hartree
zpe.thermalcorrgfe: 0.283747 hartree
zpe.sumelectzpe: -1503.583689 hartree
zpe.sumelectthermal: -1503.559962 hartree
zpe.sumelectthermalent: -1503.559018 hartree
zpe.sumelectthermalfe: -1503.640047 hartree
dipole: 3.4647 -2.5577 -0.0296
dipole: 4.3066
quadrupole: -62.1365 -118.4289 -151.1176
quadrupole: 2.9392 -4.5374 3.3372
quadrupole: 48.4245 -7.8678 -40.5566 2.9392 -4.5374 3.3372
hfenergy: -1503.9237941 hartree
pointgroup: C01 [X(C18H19N2O4S1)]
dipole: -0.948854 -1.4031639 -0.0402706 debye
polarizability: 474.6121929|107.7207567|340.0733303|26.3437578|5.361106|125.1855071 unknown
InChI: InChI=1S/C18H19N2O4S/c21-25(22,23)14-6-13-20-16-9-4-5-10-17(16)24-18(20)11-12-19-15-7-2-1-3-8-15/h1-5,7-12,19,21H,6,13-14H2
charge 1 multiplicity 1
44 atoms
S  -2.022445 3.635351 -0.319527
O  -0.069396 -2.322005 -0.148988
O  -2.478874 3.168913 -2.064334
O  -0.54297 3.026675 -0.028409
O  -2.310051 5.196256 -0.059087
N  -1.852593 -0.955198 -0.453722
N  2.616234 1.023491 -0.044838
C  -2.63085 0.283394 -0.656101
C  -2.828723 1.066664 0.669464
C  -2.364927 -2.281007 -0.395421
C  -3.38412 2.474233 0.477954
C  -0.47937 -0.995231 -0.298004
C  -1.248959 -3.130037 -0.211168
C  -3.662981 -2.811885 -0.492962
C  -1.337411 -4.517744 -0.113029
C  0.407792 0.089135 -0.271706
C  -3.779682 -4.219899 -0.396029
C  -2.646279 -5.055226 -0.210116
C  1.792451 -0.049772 -0.116664
C  4.040394 1.035514 0.09028
C  4.662344 2.295475 0.282371
C  4.820999 -0.146811 0.030133
C  6.06275 2.371684 0.421727
C  6.220118 -0.056332 0.17504
C  6.84773 1.196942 0.371303
H  -3.604278 0.001396 -1.090823
H  -2.118577 0.907039 -1.409864
H  -1.875219 1.121484 1.226123
H  -3.541985 0.526574 1.322482
H  -3.601625 2.990155 1.427064
H  -4.215854 2.573864 -0.236143
H  -4.546911 -2.184575 -0.63848
H  -0.456909 -5.148466 0.028354
H  -0.019292 1.097034 -0.348049
H  -4.771543 -4.676078 -0.467249
H  -2.783114 -6.138145 -0.140664
H  2.250479 -1.039364 -0.037976
H  -2.137523 3.869342 -2.692512
H  2.171236 1.95055 -0.077386
H  4.057034 3.209446 0.328851
H  4.366403 -1.128119 -0.138695
H  6.53849 3.345825 0.570802
H  6.823983 -0.968057 0.127177
H  7.934923 1.256016 0.479227
