program: Gaussian 09
title: 000106250
version: EM64L-G09RevD.01
frameworkgroup: C1[X(C20H14N2O6S)]
method: RPBEPBE
basis: SDD
operation: Freq
keyword: #p
keyword: freq=noraman
keyword: PBEPBE/SDD
title: #p freq=noraman PBEPBE/SDD
converged: YES YES NO NO
title: Mulliken charges:
elementType: S O O O O O O N N C C C C C C C C C C C C C C C C C C C C H H H H H H H H H H H H H H
charge: 0.973963 -0.310526 -0.297709 -0.560414 -0.483080 -0.513764 -0.426197 -0.488395 -0.663822 0.085781 0.194270 0.308962 0.393031 -0.378264 0.294000 0.280038 -0.131243 -0.167933 -0.436241 -0.384696 -0.381916 0.437106 -0.227882 -0.228435 -0.403218 -0.349025 -0.321808 -0.379146 0.283979 0.329406 0.381182 0.293097 0.294579 0.357849 0.392230 0.239124 0.239377 0.254406 0.273268 0.384734 0.257520 0.227374 0.358438
chargesum: 0.00000
title: Mulliken charges with hydrogens summed into heavy atoms:
elementType: S O O O O O O N N C C C C C C C C C C C C C C C C C C C C
charge: 0.973963 -0.310526 -0.297709 -0.175680 -0.483080 -0.513764 -0.067759 -0.107213 0.086257 0.085781 0.194270 0.308962 0.393031 -0.378264 0.294000 0.280038 -0.131243 -0.167933 -0.106835 -0.091599 -0.087337 0.437106 0.011242 0.010942 -0.148811 -0.075756 -0.064288 -0.151772 0.283979
polarizability: 6.05641240e+02 1.85786497e+01 3.67873978e+02 -1.37184854e+00 1.60005710e+01 1.40154782e+02
1716.lowfreq: -0.0007 0.0009 0.0011 1.8651 4.9281 6.5525 24.6743 30.2313 31.7338
frequency: 24.6730 30.2115 31.7114 42.4006 58.2023 82.0185 97.7794 117.3585 132.1663 141.5973 150.2764 173.7143 177.7387 193.6764 204.6993 226.6285 231.8171 259.4334 278.8859 292.2022 318.0702 327.0457 354.4743 362.9037 366.1382 381.3374 394.9283 397.0936 409.7440 416.6902 422.2099 430.4472 447.6552 456.1001 473.1950 498.7835 512.9492 515.2417 525.5166 546.2986 578.4844 624.8728 632.0810 652.4981 656.2624 671.6892 702.6091 707.8288 713.8364 736.0394 766.3488 774.4966 789.6720 804.1098 807.7166 819.5603 824.8237 837.3913 868.5736 874.8202 877.9009 885.0438 908.2698 913.6161 934.7864 949.1530 952.6590 959.9211 980.5770 997.6733 998.8206 1014.3016 1023.3763 1042.4686 1053.6666 1089.0575 1106.1878 1138.3530 1144.5253 1169.6199 1178.7113 1182.3267 1234.9558 1246.5235 1255.3701 1274.6788 1292.9410 1311.3738 1325.2784 1349.7845 1367.0264 1383.9429 1388.2586 1406.6017 1423.1144 1432.2936 1451.1846 1456.8450 1474.9198 1504.0995 1509.4957 1526.6024 1567.3150 1581.8500 1592.9454 1603.6380 1608.4815 1623.7169 1636.6026 2995.5378 3122.4080 3136.8314 3145.6249 3152.3961 3153.8751 3160.2985 3167.6870 3174.9595 3177.8601 3214.2687 3472.8501 3476.1677 3583.2110
redmass: 7.0834 6.0573 7.4642 8.0399 4.6881 7.1078 6.0375 7.4476 6.5802 6.4868 6.2269 7.1905 2.7273 3.9976 9.8165 6.9766 4.3018 3.4066 5.8189 5.1324 8.3899 8.3830 5.3644 1.1432 5.9379 6.8442 5.7336 10.7216 4.1245 3.6112 7.0957 4.1364 6.1729 10.3735 7.5735 6.6788 3.5175 4.0091 6.2578 9.0154 5.8851 5.2385 6.5877 6.1840 6.5748 2.6883 5.0602 3.6991 1.6459 2.4025 6.3469 4.2787 4.2016 1.3999 1.9174 8.2640 2.7467 2.1844 1.5000 7.0479 1.8292 2.8701 1.5877 1.4985 2.0495 4.9656 1.5874 1.3501 6.2526 1.3890 2.7413 1.3637 2.7239 1.1563 2.2258 2.4405 1.4267 2.3468 1.3272 1.2154 1.8023 1.1410 2.2688 1.6001 2.8327 2.3488 1.8920 2.9153 1.7025 3.7415 4.2854 10.1784 5.3303 9.3326 3.7029 3.7558 2.9500 4.4538 3.1215 2.8582 6.9515 6.1802 2.9472 2.4433 2.3016 3.0822 5.8321 6.1921 6.1239 1.0834 1.0895 1.0865 1.0900 1.0920 1.0909 1.0942 1.0944 1.0995 1.0962 1.0595 1.0798 1.0819 1.0661
irintensity: 0.5503 0.7755 0.2077 0.3617 1.4084 2.2582 0.6453 0.3912 0.1922 3.6852 0.2209 4.5732 25.6848 4.8156 2.0794 0.6035 9.3598 29.4542 3.5432 33.7244 13.9542 2.0018 14.7119 128.8645 9.7425 14.0265 3.0069 19.3322 21.9775 14.0064 39.1871 2.1747 4.4501 9.2301 36.5304 12.0524 30.8571 23.5944 13.5905 160.9672 20.4035 7.8208 0.8560 11.1129 10.3401 23.9743 15.0708 7.9046 66.8564 14.5650 7.3920 19.8003 3.8435 23.3286 44.6696 45.3354 73.2401 11.7601 73.0138 32.1824 71.6478 74.5336 63.0001 8.2815 0.3623 78.7462 5.1353 1.4611 9.0335 5.0662 7.3620 0.0575 33.9426 86.5797 5.8774 4.6650 89.3791 58.6717 355.3692 12.3457 8.2826 16.5743 21.4572 16.1683 57.8632 83.9115 45.4107 489.9840 190.9187 141.6324 7.3197 2.8006 35.8787 43.8909 65.8575 17.3200 6.8757 23.4758 18.5460 283.2465 96.8208 393.2304 5.4655 144.4956 53.3227 37.4881 7.0310 113.1058 65.6593 31.6973 25.7827 3.8536 4.2463 9.3676 15.7129 7.2291 1.1231 35.0074 6.8481 42.8473 182.5036 64.5389 102.1616
temp: 298.150 k
press: 1.00000 atm
elementType: 16 8 8 8 8 8 8 7 7 6 6 6 6 6 6 6 6 6 6 6 6 6 6 6 6 6 6 6 6 1 1 1 1 1 1 1 1 1 1 1 1 1 1
symmnumber: 1
zpe: 794395.5 jmol-1
zpe.correction: 0.302569 hartree
zpe.thermalcorrener: 0.327379 hartree
zpe.thermalcorrenthalpy: 0.328324 hartree
zpe.thermalcorrgfe: 0.247473 hartree
zpe.sumelectzpe: -1727.294184 hartree
zpe.sumelectthermal: -1727.269374 hartree
zpe.sumelectthermalent: -1727.268430 hartree
zpe.sumelectthermalfe: -1727.349281 hartree
dipole: 0.7032 -1.4969 2.5008
dipole: 2.9982
quadrupole: -150.2436 -177.4501 -176.6778
quadrupole: 11.4119 13.1607 11.5083
quadrupole: 17.8803 -9.3263 -8.5540 11.4119 13.1607 11.5083
hfenergy: -1727.5967532 hartree
pointgroup: C01 [X(C20H14N2O6S1)]
dipole: 0.2949342 -0.6003689 0.9715807 debye
polarizability: 603.0150681|30.6527997|369.4188152|4.4141664|22.5703246|141.2361166 unknown
InChI: InChI=1S/C20H14N2O6S/c21-18-15(29(26,27)28)9-14(22-10-5-7-11(23)8-6-10)16-17(18)20(25)13-4-2-1-3-12(13)19(16)24/h1-9,22-23,26H,21H2
charge 0 multiplicity 1
43 atoms
S  1.200844 3.859873 -0.09503
O  -0.743225 -2.745376 -0.267912
O  -3.96466 1.733603 0.129404
O  1.354114 3.968867 1.756695
O  2.676282 3.698813 -0.730466
O  0.236097 5.07619 -0.585279
O  6.97468 -1.95223 0.313508
N  1.376536 -1.323427 -0.207893
N  -1.912403 3.290324 0.049528
C  -0.872102 -0.333223 -0.093841
C  -1.712868 0.837939 -0.024021
C  0.567077 -0.203679 -0.146297
C  -1.139759 2.16815 -0.012681
C  0.296697 2.217862 -0.107171
C  -2.9421 -1.810151 -0.044814
C  -3.769843 -0.655206 0.046111
C  -1.473555 -1.676435 -0.138841
C  -3.17975 0.705372 0.051479
C  1.126141 1.11371 -0.169349
C  -3.531933 -3.101395 -0.053502
C  -5.178218 -0.804535 0.128822
C  2.787333 -1.403306 -0.056912
C  -4.928964 -3.24035 0.031629
C  -5.755036 -2.087875 0.122911
C  3.48525 -2.383105 -0.81773
C  3.514891 -0.611663 0.871888
C  4.87219 -2.554063 -0.674561
C  4.908422 -0.770602 1.008967
C  5.590399 -1.737543 0.231495
H  2.204545 1.255697 -0.288473
H  0.80996 -2.204287 -0.317286
H  -2.871224 -3.970126 -0.12746
H  -5.789086 0.100499 0.195625
H  -1.488025 4.218484 -0.057842
H  -2.934664 3.119039 0.103879
H  -5.381548 -4.237644 0.026957
H  -6.842653 -2.199459 0.187424
H  2.930707 -3.001401 -1.531789
H  2.994569 0.098696 1.521647
H  1.747694 4.864024 1.975535
H  5.415528 -3.300953 -1.260021
H  5.453915 -0.152091 1.732893
H  7.395647 -1.331217 0.958372
