program: Gaussian 09
title: 000016197
version: EM64L-G09RevD.01
frameworkgroup: C1[X(C11H13ClO2)]
method: RPBEPBE
basis: SDD
operation: Freq
keyword: #p
keyword: freq=noraman
keyword: PBEPBE/SDD
title: #p freq=noraman PBEPBE/SDD
converged: YES YES NO NO
title: Mulliken charges:
elementType: Cl O O C C C C C C C C C C C H H H H H H H H H H H H H
charge: -0.058096 -0.406328 -0.237081 -0.065278 -0.308378 0.501308 -0.715065 -0.706902 0.138338 -0.362468 -0.435537 -0.223479 -0.204661 -0.114400 0.231492 0.243584 0.208600 0.235987 0.219479 0.218148 0.202573 0.239559 0.269467 0.241672 0.254920 0.255532 0.377012
chargesum: 0.00000
title: Mulliken charges with hydrogens summed into heavy atoms:
elementType: Cl O O C C C C C C C C C C C
charge: -0.058096 -0.029316 -0.237081 0.166213 -0.064793 0.501308 -0.050998 -0.046622 0.138338 -0.093000 -0.193865 0.031441 0.050871 -0.114400
polarizability: 1.82651424e+02 -2.97163674e+00 9.70255204e+01 1.63449701e+00 6.95774449e+00 1.16934412e+02
1716.lowfreq: -15.9879 -2.5706 0.0030 0.0032 0.0033 4.8446 33.2685 44.8896 50.5689
frequency: 33.2387 44.8822 50.4535 66.1752 118.3215 143.0490 153.6663 201.6162 224.5087 246.7343 272.1852 315.9337 337.1838 352.1802 389.9773 409.0383 422.8220 457.2008 511.1684 586.9223 605.2558 626.1628 665.0437 713.1095 728.3650 816.6554 821.6316 832.5810 862.6937 894.9844 920.8167 944.7654 959.2775 964.2612 970.7691 1000.3137 1042.2685 1072.8635 1101.6384 1130.6858 1134.0171 1171.1049 1186.6311 1192.7417 1228.4893 1250.9578 1296.9877 1305.6282 1322.0662 1338.8416 1379.1814 1381.4219 1397.7367 1401.1600 1465.5837 1470.2204 1475.2168 1481.6039 1488.2219 1586.2622 1597.0018 1652.0555 2973.4131 2976.4202 2993.9116 3034.3255 3064.4534 3073.5344 3078.7807 3085.8314 3133.4514 3142.0888 3168.4241 3172.2153 3498.9089
redmass: 6.0996 4.4340 3.4494 3.8981 6.3643 4.5120 6.4470 1.0904 1.2772 5.3534 2.9806 3.6356 5.2822 4.4976 3.1646 2.8912 2.7965 3.7755 3.0541 2.0531 3.9510 6.0905 2.2383 4.2989 4.4935 2.6909 1.6987 1.2860 2.7568 2.9855 1.2043 1.6948 1.4741 1.7672 1.4197 4.3047 2.1503 2.6955 1.5009 1.8956 2.2186 1.8063 1.1206 2.3568 1.5444 1.5175 1.3545 1.4484 1.6068 1.6141 5.0212 1.2689 1.2965 2.1330 1.0524 1.0473 2.3535 1.0566 1.0467 7.3390 6.2111 8.2385 1.0365 1.0376 1.0824 1.0852 1.0986 1.0981 1.0996 1.0993 1.0900 1.0896 1.0956 1.0962 1.0638
irintensity: 1.8637 0.6131 0.0193 0.9615 0.3524 0.8715 0.0251 0.0447 0.2248 1.8872 0.9945 0.4400 1.6381 4.6351 0.7409 0.0454 1.9698 15.1250 21.9573 97.6388 34.6774 7.6784 40.6104 30.1226 34.6556 21.4354 42.2577 4.0021 3.2552 7.9329 8.2806 3.7235 0.4861 11.1562 1.1296 44.1550 255.6352 34.8183 8.4720 15.8819 21.9876 18.3060 0.1571 0.9362 2.1282 4.5122 2.5427 3.1267 20.6616 43.1736 7.1728 12.0177 21.5657 6.2252 4.6674 6.0891 81.8706 8.2352 23.0983 0.4548 9.0605 170.2868 25.5759 28.5544 6.0183 9.0646 6.0675 63.8644 28.3563 42.5804 8.3856 1.5466 4.2519 1.6926 23.1277
temp: 298.150 k
press: 1.00000 atm
elementType: 17 8 8 6 6 6 6 6 6 6 6 6 6 6 1 1 1 1 1 1 1 1 1 1 1 1 1
symmnumber: 1
zpe: 559913.9 jmol-1
zpe.correction: 0.213260 hartree
zpe.thermalcorrener: 0.227700 hartree
zpe.thermalcorrenthalpy: 0.228645 hartree
zpe.thermalcorrgfe: 0.170405 hartree
zpe.sumelectzpe: -1036.446239 hartree
zpe.sumelectthermal: -1036.431799 hartree
zpe.sumelectthermalent: -1036.430854 hartree
zpe.sumelectthermalfe: -1036.489094 hartree
dipole: 2.1271 0.6654 1.3068
dipole: 2.5836
quadrupole: -95.7344 -87.5035 -88.0324
quadrupole: -0.2056 2.1308 -1.4029
quadrupole: -5.3110 2.9199 2.3910 -0.2056 2.1308 -1.4029
hfenergy: -1036.6594989 hartree
pointgroup: C01 [X(C11H13Cl1O2)]
dipole: -0.8407165 0.0520424 -0.5689532 debye
polarizability: 182.645792|3.4844521|94.9756341|-0.0028412|1.7653685|118.9899301 unknown
InChI: InChI=1S/C11H13ClO2/c1-7(2)10(11(13)14)8-3-5-9(12)6-4-8/h3-7,10,13H,1-2H3
charge 0 multiplicity 1
27 atoms
Cl 4.802757 0.111604 0.199024
O  -2.281085 -2.302453 -0.221761
O  -2.033805 -1.167562 1.785705
C  -2.020821 1.298262 0.037128
C  -1.350071 -0.069819 -0.335811
C  0.177329 -0.048532 -0.191466
C  -3.557796 1.216469 -0.117505
C  -1.446004 2.443634 -0.825788
C  -1.910527 -1.186957 0.540076
C  0.788139 0.132702 1.076828
C  1.00378 -0.190087 -1.332816
C  2.193251 0.182288 1.203291
C  2.412349 -0.142049 -1.225465
C  2.984774 0.046672 0.045969
H  -1.787177 1.497866 1.101974
H  -1.604453 -0.312578 -1.383379
H  -3.83828 0.978864 -1.16169
H  -3.997963 0.448207 0.543379
H  -4.021448 2.18516 0.142877
H  -1.920609 3.402892 -0.549966
H  -1.64659 2.267326 -1.900543
H  -0.35542 2.552402 -0.695212
H  0.165191 0.216652 1.974218
H  0.549239 -0.339762 -2.318926
H  2.662379 0.319104 2.181989
H  3.046617 -0.25068 -2.109752
H  -2.607956 -3.021427 0.386324
