program: Gaussian 09
title: 000104763
version: EM64L-G09RevD.01
frameworkgroup: C1[X(C15H24O)]
method: RPBEPBE
basis: SDD
operation: Freq
keyword: #pfreq=noraman
keyword: PBEPBE/SDD
title: #p freq=noraman PBEPBE/SDD
converged: YES YES NO NO
title: Mulliken charges:
elementType: O C C C C C C C C C C C C C C C H H H H H H H H H H H H H H H H H H H H H H H H
charge: -0.253873 0.334699 0.358061 -0.069492 -0.147399 -0.545316 -0.106942 -0.490187 -0.520265 -0.837210 -0.846354 -0.775051 -0.553618 -0.454500 0.450911 -0.827093 0.184809 0.229203 0.212744 0.221893 0.187293 0.233986 0.226122 0.248235 0.205144 0.209673 0.218889 0.227087 0.219524 0.219551 0.241395 0.212933 0.213088 0.242106 0.209255 0.225598 0.222859 0.217492 0.231196 0.223559
chargesum: 0.00000
title: Mulliken charges with hydrogens summed into heavy atoms:
elementType: O C C C C C C C C C C C C C C C
charge: -0.253873 0.334699 0.358061 0.115317 0.081804 -0.110679 0.080350 -0.030079 -0.066886 -0.181561 -0.165884 -0.106925 -0.118765 -0.231641 0.450911 -0.154847
polarizability: 1.82399476e+02 6.99478716e+00 1.45974404e+02 3.61595040e+00 3.82966699e+00 1.37791915e+02
1716.lowfreq: -19.2163 -0.0004 0.0002 0.0008 7.6651 19.4834 67.1217 108.2155 155.5171
frequency: 66.8663 108.1911 155.4949 167.8880 171.9732 194.8694 214.0261 225.0342 229.4690 259.3891 286.8211 294.0361 295.3408 317.0520 331.2136 343.0908 370.4033 407.7792 410.4518 438.6676 455.7959 468.2244 507.4875 538.9895 562.7243 603.6836 634.4847 726.1926 745.5856 756.6877 769.9688 779.6973 824.1824 851.5418 870.9764 897.8910 904.5779 918.8842 927.5114 941.8798 954.1173 959.9715 988.4388 992.1010 1025.6564 1032.9971 1039.9319 1050.4555 1064.8399 1070.3181 1085.2621 1107.3160 1119.4679 1138.4481 1154.8047 1170.1106 1172.9796 1187.2971 1202.8627 1210.8464 1223.0002 1246.8621 1259.9183 1278.7734 1289.8284 1299.8350 1311.7424 1316.4082 1323.8825 1328.2056 1341.1205 1356.4112 1371.5801 1381.2423 1386.0239 1393.7651 1394.7509 1452.8264 1457.5985 1461.5873 1465.4291 1470.7154 1471.1491 1478.1316 1483.4090 1487.1207 1490.4602 1498.0128 1498.4909 1694.7698 2913.7766 2936.3780 2951.7737 2959.2140 2973.1013 2976.9079 2991.4374 2994.9456 2998.1475 3010.6386 3012.4623 3029.3159 3052.1082 3056.5183 3058.7556 3060.3987 3071.2862 3079.2048 3079.3353 3080.8365 3086.6993 3088.8308 3108.2007 3111.4827
redmass: 2.8670 2.7737 1.3374 1.5048 1.9828 2.4458 1.2953 2.0315 1.5551 1.8994 2.1594 1.7546 1.9782 2.5377 2.2185 3.2328 2.6680 2.5350 2.7254 3.4518 2.6026 2.3117 3.7069 3.6836 3.7513 3.9726 3.9408 3.0550 1.7756 2.4896 2.3454 2.3131 2.0499 1.9386 2.0584 1.8540 1.8454 2.6056 2.2464 1.9140 2.4665 1.9774 1.7393 1.9610 1.5683 2.0141 1.7891 1.5005 1.4117 1.9093 2.0086 2.3141 1.9336 2.5466 1.7160 2.1579 2.0433 2.0515 2.5108 1.4429 1.4465 1.4754 1.6764 1.6420 1.5334 1.4930 1.3225 1.3255 1.3090 1.3043 1.8402 1.3642 1.8297 1.2140 1.2030 1.2488 1.2090 1.0737 1.0726 1.0516 1.0718 1.0667 1.0649 1.0615 1.0608 1.0546 1.0612 1.0520 1.0640 6.8399 1.0817 1.0818 1.0581 1.0411 1.0363 1.0372 1.0423 1.0896 1.0620 1.0682 1.0646 1.0965 1.0926 1.0983 1.0971 1.0965 1.0982 1.0993 1.0997 1.0984 1.0996 1.0958 1.0921 1.0909
irintensity: 0.1168 1.5994 0.1232 0.6016 0.3019 0.9553 0.1271 1.4690 0.3632 0.9197 1.1965 0.1837 0.4825 0.1329 1.7605 0.9187 0.3355 0.8589 2.6062 3.2131 1.3110 4.9139 3.0505 0.5700 0.7619 0.7212 2.7643 3.3258 0.5577 1.3676 2.2492 3.5107 0.2228 3.6532 1.7813 11.2465 13.5678 13.8154 13.1669 5.0793 35.3746 31.7598 17.5778 12.1007 7.0607 1.6306 14.3065 2.1543 16.8556 6.9198 4.0021 0.5786 3.4601 5.0356 21.9150 0.9850 8.3386 8.9672 0.8772 3.4670 1.4361 1.1131 1.1285 2.4702 2.5679 5.6085 2.2808 1.4555 1.3925 11.9789 1.2174 2.1976 7.6666 8.7775 30.1508 8.5344 21.7031 9.9356 12.2575 13.7918 3.3971 20.4995 1.0181 7.5431 16.1160 10.9131 15.5967 11.3571 6.6933 9.5790 48.3280 42.7057 17.8649 74.7925 24.8174 45.4113 14.7382 24.8485 39.4435 57.8035 40.6313 26.9064 22.1278 9.2073 90.2569 7.1139 34.4323 31.7441 42.6484 39.8913 27.9466 32.5154 20.3334 23.6952
temp: 298.150 k
press: 1.00000 atm
elementType: 8 6 6 6 6 6 6 6 6 6 6 6 6 6 6 6 1 1 1 1 1 1 1 1 1 1 1 1 1 1 1 1 1 1 1 1 1 1 1 1
symmnumber: 1
zpe: 934870.0 jmol-1
zpe.correction: 0.356073 hartree
zpe.thermalcorrener: 0.371663 hartree
zpe.thermalcorrenthalpy: 0.372608 hartree
zpe.thermalcorrgfe: 0.315993 hartree
zpe.sumelectzpe: -659.930205 hartree
zpe.sumelectthermal: -659.914615 hartree
zpe.sumelectthermalent: -659.913671 hartree
zpe.sumelectthermalfe: -659.970285 hartree
dipole: -0.4952 1.5375 -0.5010
dipole: 1.6912
quadrupole: -91.8933 -102.1166 -99.1633
quadrupole: 2.5465 0.1821 1.9659
quadrupole: 5.8311 -4.3922 -1.4389 2.5465 0.1821 1.9659
hfenergy: -660.2862781 hartree
pointgroup: C01 [X(C15H24O1)]
dipole: -0.2021459 0.6092027 -0.175241 debye
polarizability: 182.5049698|7.1578647|145.8197676|2.6303466|3.8801453|137.8410584 unknown
InChI: InChI=1S/C15H24O/c1-10-5-7-15(4)13(9-10)16-12-6-8-14(15,3)11(12)2/h9,11-13H,5-8H2,1-4H3
charge 0 multiplicity 1
40 atoms
O  -0.194988 -1.768957 0.21191
C  -1.507563 0.767211 -0.067292
C  0.063053 0.716107 -0.354424
C  -1.967063 -0.266627 1.039629
C  -1.665036 -1.59525 0.308187
C  -2.308254 0.159408 -1.288192
C  0.460509 -0.765072 -0.678736
C  -2.342378 -1.391026 -1.069572
C  0.929302 1.211689 0.844626
C  -1.99271 2.196398 0.255073
C  0.429249 1.589758 -1.591794
C  -1.459132 -0.204981 2.492987
C  2.44575 1.133215 0.551743
C  1.94206 -1.050196 -0.582561
C  2.86003 -0.207154 -0.035978
C  4.338033 -0.539762 0.006118
H  -3.074292 -0.157072 1.075933
H  -2.000755 -2.498635 0.845157
H  -1.879213 0.430292 -2.266505
H  -3.334889 0.571947 -1.269241
H  0.130177 -0.981468 -1.720679
H  -3.380509 -1.768266 -1.030146
H  -1.820454 -1.957249 -1.861152
H  0.729399 0.587536 1.727837
H  0.660657 2.253117 1.105319
H  -3.08176 2.190124 0.452964
H  -1.497511 2.612067 1.15127
H  -1.811958 2.893401 -0.583228
H  -0.224619 1.393641 -2.458208
H  0.358063 2.666288 -1.352719
H  1.463539 1.385555 -1.919256
H  -1.369954 0.833028 2.862803
H  -2.171892 -0.729422 3.157525
H  -0.481836 -0.704876 2.599964
H  3.008196 1.307865 1.492093
H  2.762496 1.947543 -0.134044
H  2.261084 -2.023798 -0.977967
H  4.938738 0.247542 -0.492237
H  4.5583 -1.502664 -0.486576
H  4.700332 -0.598157 1.051864
