program: Gaussian 09
title: 000104486
version: EM64L-G09RevD.01
frameworkgroup: C1[X(C15H32O2)]
method: RPBEPBE
basis: SDD
operation: Freq
keyword: #pfreq=noraman
keyword: PBEPBE/SDD
title: #p freq=noraman PBEPBE/SDD
converged: YES YES NO NO
title: Mulliken charges:
elementType: O O C C C C C C C C C C C C C C C H H H H H H H H H H H H H H H H H H H H H H H H H H H H H H H H
charge: -0.261770 -0.276959 -0.388912 -0.383435 -0.375305 -0.381654 -0.370673 -0.372831 -0.433873 -0.353055 0.023895 -0.356913 -0.697016 -0.196079 -0.235147 -0.687121 -0.676135 0.195290 0.194668 0.191225 0.191812 0.188311 0.186573 0.191947 0.191566 0.220283 0.214780 0.188976 0.188462 0.195754 0.205999 0.187264 0.187600 0.185498 0.194315 0.194637 0.209533 0.209652 0.214212 0.215155 0.173588 0.196629 0.191755 0.231520 0.224971 0.200903 0.230494 0.227632 0.201980
chargesum: 0.00000
title: Mulliken charges with hydrogens summed into heavy atoms:
elementType: O O C C C C C C C C C C C C C C C
charge: -0.261770 -0.276959 0.001045 -0.000398 -0.000421 0.001859 0.064390 0.004607 -0.032121 0.021809 0.209394 0.032040 -0.063620 0.192664 0.153236 -0.029727 -0.016029
polarizability: 2.12811617e+02 -1.02964181e+00 1.61988111e+02 -1.86929347e+00 -9.68831898e-01 1.49579875e+02
1716.lowfreq: -8.3332 -0.0010 -0.0002 0.0013 4.0800 13.1763 18.1696 24.3083 38.2968
frequency: 18.1104 23.0233 37.9780 39.6834 46.4538 52.6160 62.5905 76.7746 81.1074 89.1279 110.2597 119.6801 123.7232 131.5907 150.3338 153.9961 170.8593 203.9674 219.9385 236.0354 241.7905 243.0114 273.0042 317.2942 326.6334 339.1151 388.9272 447.8060 456.1499 484.3429 541.8339 642.0021 719.1500 722.4772 730.6751 745.6250 772.4878 808.3100 812.7461 818.6363 849.3487 856.0276 888.2013 902.8607 914.5150 934.3885 970.5593 985.1628 1004.5550 1016.3110 1022.7594 1040.7570 1044.9750 1058.6126 1067.7063 1072.7764 1080.1894 1083.2116 1099.4263 1113.8745 1117.2276 1128.9860 1131.3929 1133.7655 1147.4255 1184.2484 1207.9117 1212.6884 1242.1633 1243.5006 1247.5099 1251.5590 1270.8127 1273.3440 1279.0239 1286.7471 1289.4465 1295.5456 1297.9126 1302.3671 1310.5587 1325.6568 1334.6348 1350.9117 1354.6416 1356.9593 1365.2139 1372.7004 1385.1845 1389.6223 1394.7796 1399.0054 1448.0858 1457.5118 1459.7491 1459.8974 1460.0325 1463.6665 1465.2921 1470.5690 1476.6595 1477.3383 1477.8604 1480.4873 1482.6352 1487.3583 1489.0475 1490.0338 1495.6916 2880.8357 2917.6436 2933.0163 2945.1799 2948.3613 2949.5949 2951.4825 2956.0253 2961.9575 2967.5220 2971.1065 2981.0251 2981.0740 2983.9726 2984.3882 2990.5219 2992.2915 2993.2109 2996.4662 3000.9887 3003.1659 3014.9116 3027.8515 3033.3055 3040.0669 3065.2199 3067.8069 3069.4989 3089.6076 3090.3171 3100.1102 3100.3983
redmass: 3.7669 2.6871 2.4221 2.3270 2.0992 2.6893 3.3249 1.7330 2.7911 1.9501 2.3617 2.0005 2.6224 3.5096 1.9149 2.1346 3.6753 2.9889 2.6921 1.1145 1.2042 1.2677 3.2954 3.5006 3.0585 3.3265 3.1989 2.9134 3.2128 3.0190 4.4379 4.0068 1.0592 1.0717 1.1190 1.2575 1.3953 1.4869 1.0992 1.1016 1.7617 2.0254 1.8976 1.4459 2.6926 2.4324 1.3108 4.2154 4.1325 2.6356 1.2404 3.2040 3.1330 3.2332 2.9980 2.6606 2.0703 2.3261 2.3095 2.1911 2.0959 2.3622 1.4974 1.4728 1.7481 1.7944 1.2985 1.4897 1.3273 1.3208 1.1789 1.1586 1.2431 1.3391 1.0194 1.0544 1.1542 1.0867 1.1392 1.3752 1.2481 1.2586 1.3620 1.5411 1.6840 1.6425 1.6147 1.3566 1.2378 1.2178 1.2895 1.3046 1.0850 1.0412 1.0441 1.0728 1.0714 1.0647 1.0773 1.0802 1.0814 1.0535 1.0425 1.0476 1.0852 1.0897 1.0955 1.0755 1.0830 1.0826 1.0631 1.0558 1.0588 1.0587 1.0590 1.0593 1.0593 1.0587 1.0584 1.0367 1.1025 1.1000 1.0605 1.0977 1.0998 1.0360 1.0360 1.0595 1.1021 1.0970 1.1041 1.1039 1.1016 1.1046 1.1043 1.1006 1.0994 1.0990 1.0990 1.1010 1.1009
irintensity: 0.1888 0.2572 0.1943 0.4630 0.9256 1.3497 1.2996 0.0086 0.3449 0.1062 4.1266 1.3125 0.5107 2.0853 0.1902 0.0559 0.4465 0.3144 0.2042 0.0013 0.2364 0.9439 3.6713 6.2753 1.0634 1.6020 0.5251 1.0590 0.2660 0.4312 2.4427 2.4746 16.3396 0.1479 0.8051 9.0998 9.1328 31.4046 3.3256 4.7256 11.1212 1.9152 4.6026 8.0858 43.9912 117.0362 23.0219 7.1152 0.5130 5.3963 13.2500 80.2887 10.4638 49.0306 52.9236 14.7354 0.1582 7.6625 16.8485 15.2441 3.8145 25.3669 11.3464 8.0974 21.5917 1.7952 30.8961 1.0452 8.1469 0.6677 3.3489 0.5622 1.7551 10.4131 0.2760 1.2254 1.4535 0.1863 3.4839 22.3351 26.3001 29.4654 6.1251 0.7442 0.2828 0.2561 2.0741 3.6686 13.5034 11.2072 16.6608 14.5345 4.4683 11.6680 9.9710 0.5314 0.9480 0.1640 0.1628 0.3428 1.6906 9.1924 12.0856 2.3794 1.1726 0.6164 39.5563 5.2579 3.1155 51.6320 46.5015 116.7818 9.6195 1.2555 3.1086 0.2567 0.2291 76.1299 170.4206 36.5471 30.0751 24.2010 29.8729 1.7248 1.5468 27.9962 22.4741 48.0700 1.4063 39.6090 6.3468 4.0592 15.9899 169.0616 84.6923 101.7896 58.7353 29.9969 44.6975 37.3926 38.8349
temp: 298.150 k
press: 1.00000 atm
elementType: 8 8 6 6 6 6 6 6 6 6 6 6 6 6 6 6 6 1 1 1 1 1 1 1 1 1 1 1 1 1 1 1 1 1 1 1 1 1 1 1 1 1 1 1 1 1 1 1 1
symmnumber: 1
zpe: 1165763.1 jmol-1
zpe.correction: 0.444016 hartree
zpe.thermalcorrener: 0.467427 hartree
zpe.thermalcorrenthalpy: 0.468372 hartree
zpe.thermalcorrgfe: 0.387004 hartree
zpe.sumelectzpe: -739.775526 hartree
zpe.sumelectthermal: -739.752114 hartree
zpe.sumelectthermalent: -739.751170 hartree
zpe.sumelectthermalfe: -739.832537 hartree
dipole: 2.4885 -0.8070 0.7192
dipole: 2.7131
quadrupole: -90.9634 -107.0758 -109.3222
quadrupole: -3.3367 1.1910 -1.3812
quadrupole: 11.4904 -4.6220 -6.8684 -3.3367 1.1910 -1.3812
hfenergy: -740.2195414 hartree
pointgroup: C01[X(C15H32O2)]
dipole: -0.9723715 0.3446544 0.2740238 debye
polarizability: 212.7813688|-1.7865184|162.0909865|1.6529943|0.4436082|149.5072476 unknown
InChI: InChI=1S/C15H32O2/c1-4-7-8-9-10-11-12-13-14-15(16-5-2)17-6-3/h15H,4-14H2,1-3H3
charge 0 multiplicity 1
49 atoms
O  -3.931648 -1.239551 0.235949
O  -3.932532 1.1250 -0.234762
C  1.304691 -0.03447 0.089651
C  2.697807 0.059714 0.751642
C  0.137138 0.122484 1.090027
C  3.864329 -0.095549 -0.250282
C  -1.250811 0.020972 0.420455
C  5.258302 -0.003902 0.410697
C  -2.404099 0.174332 1.43602
C  6.42408 -0.154517 -0.592872
C  -3.796967 0.089029 0.805204
C  7.818663 -0.063401 0.067843
C  8.976408 -0.209847 -0.943664
C  -5.244346 -1.496281 -0.382625
C  -5.124597 1.98387 -0.103827
C  -5.268858 -2.962966 -0.810662
C  -5.113767 2.952737 -1.285998
H  1.210413 -1.011192 -0.429432
H  1.218388 0.743916 -0.697101
H  2.790843 1.035882 1.272796
H  2.783764 -0.720467 1.537061
H  0.226044 -0.655089 1.878291
H  0.229305 1.101285 1.607395
H  3.770062 -1.070802 -0.772594
H  3.778764 0.685425 -1.034814
H  -1.353355 -0.95478 -0.090859
H  -1.353287 0.800471 -0.35874
H  5.345149 -0.787115 1.192962
H  5.351357 0.970182 0.935664
H  -2.326132 1.152203 1.951045
H  -2.330727 -0.614976 2.210068
H  6.338544 0.629137 -1.374799
H  6.332166 -1.128147 -1.118772
H  -4.601806 0.248056 1.565434
H  7.908346 0.908176 0.595746
H  7.904359 -0.848547 0.846802
H  8.93053 0.582996 -1.714155
H  8.926292 -1.185084 -1.464118
H  9.96196 -0.142014 -0.446869
H  -5.376023 -0.822404 -1.252883
H  -6.050732 -1.28031 0.355886
H  -5.087888 2.539397 0.85828
H  -6.049451 1.366828 -0.10845
H  -4.455307 -3.165003 -1.528611
H  -5.131942 -3.626046 0.060976
H  -6.232336 -3.208938 -1.293724
H  -4.18996 3.556575 -1.280033
H  -5.155835 2.399965 -2.240436
H  -5.981198 3.636268 -1.235012
