program: Gaussian 09
title: 000106264
version: EM64L-G09RevD.01
frameworkgroup: C1[X(C27H20N2O8S2)]
method: RPBEPBE
basis: SDD
operation: Freq
keyword: #p
keyword: freq=noraman
keyword: PBEPBE/SDD
title: #p freq=noraman PBEPBE/SDD
converged: YES YES NO NO
title: Mulliken charges:
elementType: S S O O O O O O O O N N C C C C C C C C C C C C C C C C C C C C C C C C C C C H H H H H H H H H H H H H H H H H H H H
charge: 0.978010 0.939786 -0.302560 -0.291615 -0.559386 -0.472207 -0.510513 -0.371357 -0.506552 -0.506802 -0.481954 -0.661201 0.078274 0.188483 0.327164 0.400083 -0.388921 0.294134 0.280509 -0.125877 -0.160740 -0.431298 -0.380050 -0.378188 0.453460 -0.226274 -0.225877 -0.400767 -0.339862 0.291626 -0.311005 -0.326189 -0.076346 -0.235287 -0.229805 0.453245 -0.359828 -0.361244 -0.798753 0.335020 0.384488 0.293991 0.295834 0.362039 0.393223 0.241761 0.241845 0.250624 0.272708 0.258384 0.259496 0.388356 0.282649 0.280208 0.244456 0.244194 0.244054 0.231279 0.231075
chargesum: 0.00000
title: Mulliken charges with hydrogens summed into heavy atoms:
elementType: S S O O O O O O O O N N C C C C C C C C C C C C C C C C C C C C C C C C C C C
charge: 0.978010 0.939786 -0.302560 -0.291615 -0.171030 -0.472207 -0.510513 -0.371357 -0.506552 -0.506802 -0.097466 0.094060 0.078274 0.188483 0.327164 0.400083 -0.388921 0.294134 0.280509 -0.125877 -0.160740 -0.096278 -0.086059 -0.082354 0.453460 0.015487 0.015968 -0.150142 -0.067154 0.291626 -0.052621 -0.066692 -0.076346 0.047361 0.050403 0.453245 -0.115371 -0.117050 -0.092345
polarizability: 1.26441267e+03 -8.52288014e+01 4.69404970e+02 -2.80886400e+01 -2.17515589e+01 2.28775815e+02
1716.lowfreq: -30.6858 -7.3022 -2.0249 -0.1270 -0.0116 0.0014 0.7625 4.9631 7.2902
frequency: -30.6534 -3.9034 4.2953 11.8114 21.5670 28.1422 29.3452 40.7118 44.8378 51.6202 63.0860 78.0545 98.5457 105.4442 113.2871 127.8012 128.8970 139.9974 149.9735 159.9015 172.8521 178.6988 187.6461 205.6104 215.6078 230.4148 233.5672 236.8607 272.1962 281.5307 284.5089 291.3858 300.9378 319.9755 332.3494 361.4954 371.8975 375.3555 380.1453 396.4672 401.3303 406.6261 408.6287 411.5328 417.5484 420.4404 426.0213 432.9711 449.0263 457.8991 475.9811 504.2148 507.9454 514.5875 523.6830 542.4037 549.6188 579.7982 589.2371 620.3065 623.9760 625.1270 653.3004 658.4503 673.4551 705.2461 705.9549 724.1504 724.3963 738.0298 769.4089 776.7523 783.9073 792.9159 807.5967 809.0389 817.0564 822.2703 825.0783 829.2393 845.9072 851.5359 868.3365 875.8745 878.3502 887.9072 923.7441 924.4905 930.7007 935.8340 952.4116 963.0277 966.3853 975.4975 979.8147 982.9404 989.7894 991.2025 991.8844 998.4617 1015.5612 1023.5626 1047.1118 1049.0349 1050.1467 1054.8407 1089.7798 1114.1965 1119.4165 1136.8571 1157.9599 1170.8104 1179.3786 1185.3011 1219.1627 1229.7517 1246.8123 1247.4245 1277.2792 1295.5095 1297.3090 1298.0397 1315.5475 1348.5307 1358.3398 1377.0405 1380.7898 1390.5826 1392.5469 1399.5635 1407.5807 1426.1557 1440.1893 1450.9800 1454.7655 1470.3778 1471.6324 1473.6385 1473.7447 1484.0404 1510.2147 1523.6795 1534.3211 1572.5040 1588.9057 1592.4550 1593.7390 1598.4027 1606.8052 1610.4644 1632.6530 2978.6180 2981.0373 3063.7473 3093.3567 3136.8223 3138.3873 3138.4481 3139.1498 3149.2793 3155.7060 3156.6005 3164.5908 3167.3479 3168.9657 3172.3033 3176.1779 3176.3443 3223.6318 3463.5876 3474.1991
redmass: 1.0255 6.6691 5.8009 6.7333 6.6490 6.5676 7.1237 7.4858 7.4245 7.7530 4.4668 7.6415 6.2590 5.3789 6.1249 6.9479 7.0621 7.5419 6.4075 9.2071 6.6987 6.8499 2.6745 10.2824 7.4751 6.5861 6.9085 3.2563 3.8417 5.7420 5.5344 4.8018 5.5600 8.7480 8.3584 6.4770 8.0304 3.6243 6.3333 11.1193 7.5598 2.9104 4.0311 6.6135 6.9039 4.8677 4.6595 5.2808 6.1784 11.0773 7.3266 4.4604 4.4300 5.2134 5.0042 3.6842 8.2296 5.7410 5.5795 6.9603 6.0196 5.9677 6.2057 6.7751 3.0331 3.3375 5.8603 1.4754 3.9708 2.2799 6.1979 4.8448 4.2806 3.6239 9.0567 2.0257 1.4210 9.8278 1.3492 4.7875 1.2454 1.8303 1.4379 6.4811 2.0909 4.1148 1.6544 6.6919 1.4730 2.0150 10.3113 1.2982 1.3661 1.3670 6.2766 1.3787 1.4058 3.1104 4.0811 1.3887 1.3671 2.7382 1.1704 1.6581 2.3148 2.1852 2.4385 1.3449 1.2864 2.3327 1.4561 1.2107 1.9020 1.1347 3.0484 2.2813 2.4907 1.7403 2.1683 1.8570 1.3144 1.6120 3.9681 3.6509 3.8574 4.4928 5.6689 8.9310 3.1235 1.2194 9.3589 3.8290 4.6319 2.9068 4.2209 1.1061 2.3151 1.0949 2.4560 3.2405 7.0368 5.8615 6.8649 2.8208 2.3992 6.8635 5.9376 2.6697 4.8595 2.7285 5.8846 1.0835 1.0391 1.0946 1.1001 1.0893 1.0897 1.0896 1.0866 1.0897 1.0909 1.0903 1.0954 1.0967 1.0945 1.0959 1.0973 1.0996 1.0581 1.0966 1.0669
irintensity: 0.3471 1.7965 0.1006 0.8579 0.8073 0.1634 0.2713 0.6844 0.1959 1.8488 7.7565 9.7710 1.0753 8.4505 12.7987 45.9663 10.1355 6.5702 10.0056 7.0164 24.4961 2.9854 4.2421 2.1604 69.6867 48.6015 22.5384 32.4316 14.0881 3.0532 7.9947 2.2328 33.1359 23.7519 1.7146 26.6770 8.1741 0.6638 15.9970 31.0385 23.6957 1.0848 31.8141 127.8756 95.1865 86.6851 11.2134 41.1741 12.1772 8.0023 26.3417 40.2110 65.2444 16.1571 21.3922 30.4347 119.4341 26.8292 42.2272 0.2449 7.8013 6.6206 21.5726 1.1630 17.0266 1.1479 4.0359 76.7336 4.5986 12.9214 0.8504 5.2663 14.6552 0.6918 100.7933 63.5309 7.0913 50.4526 30.9116 44.1633 0.4810 63.4520 92.3091 26.4358 67.6462 86.0869 134.2184 90.6041 4.7144 6.6295 58.2671 8.4143 1.5630 3.4205 6.1591 0.0433 1.1795 20.0163 7.9924 4.9325 0.0975 53.5562 84.6454 39.5866 34.6267 14.0842 7.8812 9.2767 10.7725 102.6312 108.2989 13.4527 9.8332 68.2468 27.2106 40.9160 43.3357 11.3191 87.8195 10.7766 42.2191 244.6195 882.6817 152.2208 234.8201 18.6935 0.1901 3.3096 10.0799 16.4114 51.5409 76.9404 18.2307 21.2499 8.8957 17.0597 53.7841 10.9181 12.3980 26.7069 114.5511 926.9738 0.7482 8.2956 388.4946 0.1679 16.4703 100.2421 37.8711 77.1553 89.7562 116.5710 32.8632 24.9940 14.3006 13.3248 17.8156 7.7187 3.3705 4.1923 19.1300 9.8991 1.4835 27.6957 0.7467 3.7740 0.8653 41.0971 78.5632 207.0134 37.5335
temp: 298.150 k
press: 1.00000 atm
elementType: 16 16 8 8 8 8 8 8 8 8 7 7 6 6 6 6 6 6 6 6 6 6 6 6 6 6 6 6 6 6 6 6 6 6 6 6 6 6 6 1 1 1 1 1 1 1 1 1 1 1 1 1 1 1 1 1 1 1 1
symmnumber: 1
zpe: 1088301.5 jmol-1
zpe.correction: 0.414512 hartree
zpe.thermalcorrener: 0.448887 hartree
zpe.thermalcorrenthalpy: 0.449831 hartree
zpe.thermalcorrgfe: 0.343946 hartree
zpe.sumelectzpe: -2545.276171 hartree
zpe.sumelectthermal: -2545.241796 hartree
zpe.sumelectthermalent: -2545.240852 hartree
zpe.sumelectthermalfe: -2545.346736 hartree
dipole: -0.7065 -4.2851 -4.4506
dipole: 6.2185
quadrupole: -164.3960 -232.3259 -247.8625
quadrupole: -5.0744 18.3747 -17.9086
quadrupole: 50.4654 -17.4644 -33.0011 -5.0744 18.3747 -17.9086
hfenergy: -2545.6906828 hartree
pointgroup: C01 [X(C27H20N2O8S2)]
dipole: -0.2697167 -1.9083511 -1.506993 debye
polarizability: 1266.4357357|-75.0853261|456.6012877|-32.4521048|-51.7567358|239.5564331 unknown
InChI: InChI=1S/C20H13N2O6S.C7H7O2S/c21-18-15(29(26,27)28)9-14(22-10-5-7-11(23)8-6-10)16-17(18)20(25)13-4-2-1-3-12(13)19(16)24;1-6-2-4-7(5-3-6)10(8)9/h1-9,22,26H,21H2;2-5H,1H3
charge 0 multiplicity 1
59 atoms
S  2.174927 4.078282 -0.317107
S  -5.554518 0.418278 0.983889
O  2.995579 -2.695955 0.648743
O  6.877123 1.054636 -0.530909
O  1.866254 3.980399 -2.146034
O  0.763794 4.261256 0.443008
O  3.379073 5.142677 -0.064661
O  -4.446097 -0.987452 -0.135791
O  -5.174991 1.910328 0.440666
O  -5.469767 0.072206 2.576925
N  1.138366 -0.955502 0.452602
N  5.125754 2.947327 -0.56567
C  3.505953 -0.38759 0.114635
C  4.524311 0.597261 -0.149066
C  2.117385 -0.001651 0.205421
C  4.182882 1.997086 -0.313703
C  2.78688 2.312202 -0.15364
C  5.294761 -2.201881 0.183478
C  6.294315 -1.231598 -0.109062
C  3.880436 -1.801831 0.326651
C  5.940235 0.199505 -0.274293
C  1.790154 1.384874 0.089977
C  5.659001 -3.564195 0.346041
C  7.64793 -1.633997 -0.238624
C  -0.258102 -0.872939 0.30228
C  7.003751 -3.955209 0.213369
C  8.001069 -2.987192 -0.080156
C  -1.046049 -1.776173 1.082417
C  -0.908907 -0.002992 -0.627258
C  -3.093661 -0.922061 0.033249
C  -2.439378 -1.790456 0.964109
C  -2.304144 -0.021804 -0.750039
C  -7.248949 -0.059575 0.344226
C  -7.988263 -1.006474 1.071409
C  -7.711794 0.548006 -0.834238
C  -9.78526 -0.770914 -0.603706
C  -9.268103 -1.350857 0.585565
C  -8.99471 0.184112 -1.297377
C  -11.148077 -1.176629 -1.132961
H  0.765543 1.731318 0.256508
H  1.568833 -1.88491 0.702085
H  4.870644 -4.287434 0.574002
H  8.395344 -0.867125 -0.46189
H  4.870502 3.942072 -0.566059
H  6.098812 2.597308 -0.646428
H  7.283048 -5.006867 0.336402
H  9.047082 -3.295092 -0.181844
H  -0.543949 -2.442278 1.792989
H  -0.322921 0.641049 -1.289102
H  -3.05396 -2.461761 1.57167
H  -2.8146 0.633342 -1.46273
H  1.509925 4.868122 -2.44464
H  -7.586298 -1.437948 1.993414
H  -7.101972 1.293173 -1.354261
H  -9.872018 -2.07938 1.138417
H  -9.385795 0.649492 -2.209296
H  -11.060222 -2.042308 -1.817794
H  -11.829573 -1.472491 -0.31681
H  -11.624382 -0.357788 -1.699302
