program: Gaussian 09
title: 000104397
version: EM64L-G09RevD.01
frameworkgroup: C1[X(C12H14ClNO3S2)]
method: RPBEPBE
basis: SDD
operation: Freq
keyword: #p
keyword: freq=noraman
keyword: PBEPBE/SDD
title: #p freq=noraman PBEPBE/SDD
converged: NO YES NO NO
title: Mulliken charges:
elementType: Cl S S O O O N C C C C C C C C C C C C H H H H H H H H H H H H H H
charge: -0.054706 0.248093 1.066470 -0.565310 -0.507525 -0.580218 -0.227564 -0.488228 -0.389527 -0.371610 0.681341 0.156099 -0.616706 -0.440842 -0.296736 -0.842991 -0.266185 -0.112438 -0.257162 0.237099 0.286676 0.242098 0.255512 0.253338 0.235845 0.301926 0.295578 0.271781 0.248073 0.323628 0.399738 0.251879 0.262575
chargesum: 0.00000
title: Mulliken charges with hydrogens summed into heavy atoms:
elementType: Cl S S O O O N C C C C C C C C C C C C
charge: -0.054706 0.248093 1.066470 -0.565310 -0.507525 -0.180480 -0.227564 0.035547 0.108082 0.117573 0.681341 0.156099 -0.019203 -0.440842 -0.024955 -0.271290 -0.014306 -0.112438 0.005413
polarizability: 3.16005262e+02 1.96027603e+01 2.10189614e+02 1.41316804e+01 -5.44772718e+00 1.19425379e+02
1716.lowfreq: -1.7849 -0.0006 0.0015 0.0021 7.4676 9.2813 38.3814 55.9573 57.9534
frequency: 38.2355 55.8411 57.8038 71.1910 99.9851 110.7314 140.2196 147.8696 167.4701 183.0003 192.0061 212.7791 243.9937 279.4541 289.6181 300.9011 311.4254 312.5147 333.8280 335.6216 357.8061 382.8703 432.5982 449.0595 456.1754 473.6511 514.7544 540.5640 556.4569 572.8807 582.8648 610.0558 631.6669 668.9371 702.0686 711.2388 751.1501 797.7763 799.1542 808.1144 815.9193 839.2365 840.4553 856.1988 871.3773 931.8508 949.1603 961.1678 984.5589 1022.3862 1028.9996 1069.8263 1075.3119 1092.4977 1100.2658 1138.8442 1149.4751 1181.6216 1220.4226 1247.9417 1253.6615 1278.0657 1282.6302 1301.5954 1310.1146 1327.2781 1355.7169 1371.3310 1390.5047 1412.7205 1414.5352 1432.3342 1449.5078 1459.3870 1483.7595 1511.9390 1561.8112 1584.8245 1596.9696 2605.2621 2987.7393 3007.0059 3011.8478 3039.7447 3049.1413 3063.9215 3088.0350 3094.2284 3139.3003 3160.4697 3177.4665 3186.1502 3210.0163
redmass: 8.0082 5.7948 7.7655 6.6917 9.4018 10.3976 4.7637 5.6159 3.2904 6.5491 5.0975 4.3315 4.8188 3.6063 6.4187 5.0497 6.5213 5.4676 4.7694 4.4394 2.9363 5.1710 3.1432 5.3425 3.8465 6.3405 4.9570 7.0805 5.8273 7.0372 5.9388 4.8512 1.1279 4.6371 5.1177 4.1203 1.3434 1.3089 1.3217 3.9524 3.2993 1.6041 1.5163 1.3232 1.7509 1.3424 6.2309 3.5849 2.6157 2.8083 3.2004 2.0609 2.7278 1.8987 2.4432 1.3964 1.2706 1.6214 1.5060 1.3000 1.0846 1.3347 1.2700 2.2107 1.4206 1.3852 1.3208 1.3736 7.3066 1.3525 1.2993 1.9718 1.0820 3.2663 1.0756 1.0983 5.0789 7.1017 8.2156 1.0834 1.0620 1.0632 1.0650 1.0848 1.0695 1.0999 1.0950 1.0689 1.1102 1.0900 1.0925 1.0963 1.1120
irintensity: 1.6629 2.1153 1.7277 1.2435 1.1095 5.4256 1.4719 1.9527 18.6940 71.7333 26.6726 5.5830 15.4795 0.6789 2.7366 29.7489 0.1875 14.4326 6.5529 13.7671 3.8143 8.0147 13.8388 20.7442 5.9633 1.1015 20.6400 6.9506 7.7534 88.8221 46.8962 10.4408 24.0433 1.7915 0.7895 0.7916 14.8322 62.9527 30.4564 75.3653 47.4543 48.0726 21.8707 411.9341 61.5637 0.0333 92.9895 84.7603 38.6380 10.9090 9.6582 20.3250 6.4369 2.6913 1.1266 17.9306 0.4943 25.0900 19.0648 10.0612 33.5561 0.7614 5.9160 28.3543 19.6123 7.2882 1.1088 3.7281 20.9024 34.5211 10.6788 42.8948 15.3365 120.7618 5.5873 23.1983 704.9368 47.9456 88.6616 2525.9803 17.5794 21.3356 20.8182 5.8785 7.4826 6.7219 7.6156 27.1720 0.7985 2.3808 2.7597 0.6910 0.9321
temp: 298.150 k
press: 1.00000 atm
elementType: 17 16 16 8 8 8 7 6 6 6 6 6 6 6 6 6 6 6 6 1 1 1 1 1 1 1 1 1 1 1 1 1 1
symmnumber: 1
zpe: 631992.3 jmol-1
zpe.correction: 0.240713 hartree
zpe.thermalcorrener: 0.259826 hartree
zpe.thermalcorrenthalpy: 0.260770 hartree
zpe.thermalcorrgfe: 0.193225 hartree
zpe.sumelectzpe: -2000.676492 hartree
zpe.sumelectthermal: -2000.657380 hartree
zpe.sumelectthermalent: -2000.656435 hartree
zpe.sumelectthermalfe: -2000.723980 hartree
dipole: -4.3797 -2.7034 -0.3911
dipole: 5.1617
quadrupole: -167.0441 -122.8617 -140.9715
quadrupole: -18.4981 2.9884 0.3142
quadrupole: -23.4183 20.7641 2.6542 -18.4981 2.9884 0.3142
hfenergy: -2000.9172053 hartree
pointgroup: C01 [X(C12H14Cl1N1O3S2)]
dipole: 1.2531181 -1.5965336 -0.0691348 debye
polarizability: 290.1636573|-51.5338257|232.3478368|11.9374297|17.2628799|123.1087601 unknown
InChI: InChI=1S/C12H14ClNO3S2/c1-9-14(6-2-3-7-19(15,16)17)11-8-10(13)4-5-12(11)18-9/h4-5,8,15H,1-3,6-7H2
charge 0 multiplicity 1
33 atoms
Cl 4.011517 -3.386008 -0.517078
S  2.287527 2.665973 0.66801
S  -3.66907 1.463972 0.240288
O  -3.234218 1.754833 -1.308346
O  -5.059071 2.057922 0.799066
O  -2.307001 1.955779 1.35695
N  0.800658 0.829531 -0.566441
C  -0.386748 0.09854 -1.066188
C  -1.071308 -0.733204 0.057373
C  -2.53707 -1.126396 -0.298143
C  2.002769 0.163615 -0.247141
C  0.731739 2.181869 -0.187312
C  -3.610913 -0.454853 0.559886
C  2.94476 0.985147 0.430457
C  2.321514 -1.180466 -0.542658
C  -0.312863 3.065075 -0.367133
C  4.196641 0.493453 0.826193
C  3.586049 -1.653121 -0.140953
C  4.528354 -0.854048 0.53517
H  -0.075008 -0.550001 -1.906049
H  -1.103952 0.827574 -1.475231
H  -0.475958 -1.640576 0.263391
H  -1.065378 -0.130192 0.983339
H  -2.751117 -0.929088 -1.365976
H  -2.681441 -2.215436 -0.153212
H  -3.430029 -0.505698 1.64496
H  -4.638433 -0.765734 0.308307
H  1.626281 -1.836609 -1.070834
H  -0.176155 4.107899 -0.069229
H  -1.113531 2.861949 -1.088206
H  -1.57503 2.474409 0.8147
H  4.915187 1.130184 1.350222
H  5.496799 -1.265295 0.829818
