program: Gaussian 09
title: 000104872
version: EM64L-G09RevD.01
frameworkgroup: C1[X(C21H20NO6)]
method: RPBEPBE
basis: SDD
operation: Freq
keyword: #p
keyword: freq=noraman
keyword: PBEPBE/SDD
title: #p freq=noraman PBEPBE/SDD
converged: NO YES NO NO
title: Mulliken charges:
elementType: O O O O O O N C C C C C C C C C C C C C C C C C C C C C H H H H H H H H H H H H H H H H H H H H
charge: -0.288257 -0.251454 -0.242222 -0.211971 -0.236535 -0.144546 -0.117517 -0.253769 -0.409325 -0.226219 0.352184 -0.566610 0.319715 -0.581002 -0.597957 0.416246 -0.516224 -0.474340 0.047997 0.171781 0.124657 0.175492 -0.460555 0.057058 0.160066 -0.323258 -0.202630 -0.204061 0.281147 0.340171 0.257872 0.282208 0.279701 0.251330 0.301438 0.257303 0.264067 0.263551 0.293277 0.268809 0.284815 0.276571 0.256888 0.275544 0.259231 0.258569 0.266733 0.264032
chargesum: 1.00000
title: Mulliken charges with hydrogens summed into heavy atoms:
elementType: O O O O O O N C C C C C C C C C C C C C C C C C C C C C
charge: -0.288257 -0.251454 -0.242222 -0.211971 -0.236535 -0.144546 -0.117517 0.027379 0.188718 0.055990 0.352184 -0.035580 0.319715 0.241807 0.227679 0.416246 -0.231408 -0.197770 0.047997 0.171781 0.124657 0.175492 -0.203667 0.057058 0.160066 -0.047713 0.315169 0.326704
polarizability: 2.83061313e+02 4.20606640e+01 2.35556624e+02 -1.23138284e+01 1.32995772e+01 2.14881986e+02
1716.lowfreq: -10.1068 -0.0007 0.0002 0.0004 1.6530 6.8990 21.6817 23.9346 45.7245
frequency: 21.6322 23.5817 45.5923 54.0454 64.4808 75.5464 82.9038 109.8420 129.7916 157.2649 164.7466 188.5557 205.7560 215.2612 223.6701 240.4875 255.1985 262.1312 279.4114 295.7703 317.1203 330.6636 346.8440 370.9053 381.7627 392.6542 421.2724 431.1664 456.0698 470.7750 493.8250 502.2662 519.8897 533.0287 549.1009 595.1673 615.8003 635.1549 648.1672 662.2187 678.7103 684.8413 697.5378 700.3366 710.6301 717.9025 740.3491 754.5750 774.9821 796.7163 809.9748 818.8809 823.3615 830.6308 838.7286 855.7990 871.0392 883.4058 886.0189 911.9885 916.6820 937.1998 955.4473 967.6142 969.5568 976.9090 1004.4427 1028.0337 1048.4389 1053.2949 1058.2093 1060.8037 1070.6047 1102.2684 1119.7242 1119.9827 1131.5397 1137.9241 1163.1172 1174.8016 1181.8144 1183.0257 1199.6911 1219.5627 1226.6411 1232.5786 1251.1590 1251.7195 1259.6523 1264.9355 1302.0952 1319.6039 1329.1656 1355.4030 1363.6216 1365.4159 1397.9386 1411.4252 1422.1388 1422.9919 1439.0621 1440.8363 1444.7081 1457.7953 1464.4787 1469.9244 1472.6216 1475.8325 1481.2753 1486.6430 1489.2053 1489.9262 1501.4545 1615.5212 1621.9981 1624.4536 1638.7098 1744.9474 2983.2313 2998.5454 3018.1857 3023.7358 3026.8095 3033.7567 3037.8717 3042.6741 3043.8705 3115.4220 3125.2361 3133.1348 3134.1695 3137.0906 3143.3822 3150.3700 3159.4470 3169.3107 3176.8072 3190.1166
redmass: 6.7792 7.2622 3.2449 3.3771 3.5464 3.2659 5.4193 6.7336 5.5585 7.5442 5.2760 6.9750 6.7464 3.0967 2.4680 6.4591 1.2929 5.3110 3.0933 1.5743 3.0118 2.1846 4.1773 4.6776 6.8092 3.4986 3.5060 3.0848 4.8852 4.9117 4.4427 3.5832 4.1041 7.8376 5.5924 5.4149 6.4164 6.6002 4.7838 6.8901 9.1303 8.6050 6.8166 10.4554 4.2155 5.7250 3.1684 8.0867 4.7806 4.7457 4.3715 2.4309 2.8241 6.8146 6.0478 1.6089 1.5676 3.7929 2.6201 3.5090 2.4228 1.3873 6.5294 4.2801 5.8182 2.7523 3.3017 3.5063 2.3059 3.0011 1.4551 1.4511 2.4946 1.2971 1.0380 1.0367 1.6710 1.7499 1.3847 1.6046 2.7460 3.5360 1.4711 1.4923 1.5660 1.5608 4.9502 1.3626 1.6732 3.5679 1.5157 1.3739 1.4442 1.5447 1.3095 1.3467 1.2211 4.6193 1.3678 2.9691 3.4727 3.7517 1.1527 1.0811 1.1175 1.1892 1.3463 1.4588 1.0697 1.0749 2.2311 2.1346 1.0588 8.6756 8.8870 7.8885 9.7962 12.8833 1.0651 1.0845 1.0767 1.0390 1.0348 1.0642 1.0538 1.0919 1.0540 1.1073 1.1198 1.1049 1.1199 1.1046 1.0911 1.1050 1.1041 1.0934 1.0929 1.0953
irintensity: 0.1973 2.1517 4.4757 15.3958 4.4354 6.0742 3.5703 0.1739 0.2408 1.4465 2.7414 3.5839 2.2232 0.1504 0.7890 0.1370 0.2778 1.8700 3.4532 2.9431 1.3263 1.3628 4.4976 0.7679 0.9164 0.9693 1.5966 13.0359 2.4152 0.1769 3.8643 1.8396 2.3261 1.0358 7.1669 12.9560 0.5039 0.1684 3.3968 0.6996 1.4999 3.1266 8.4985 1.8875 1.8935 0.6042 6.9749 7.0977 2.5130 35.1550 49.3926 37.6687 9.2221 129.1107 148.1613 11.3371 28.7664 24.3604 45.9439 6.2813 1.2933 0.6008 130.1190 42.6299 147.9311 18.1290 4.3438 5.1419 11.4966 1.1656 4.5033 4.4181 12.1717 0.2392 0.0149 0.0102 3.2895 3.2089 3.7288 14.6715 5.2069 51.2253 4.2857 29.5996 3.9010 39.4023 240.1605 33.9812 4.9223 191.8610 6.0162 20.0637 7.3605 31.9079 2.6969 1.6942 1.3248 114.0932 11.5601 7.1327 29.0374 8.5262 12.5552 18.6999 16.5082 38.1697 25.2439 101.8998 38.8661 13.9690 46.3490 139.2795 52.8151 13.7730 4.4132 7.8069 23.4762 324.3171 18.6708 6.7641 16.0107 7.8053 6.6789 44.7601 71.1113 5.8074 61.0572 4.4738 14.8881 2.8613 11.1690 7.1382 5.3847 2.4617 1.1547 0.3087 0.9908 0.2564
temp: 298.150 k
press: 1.00000 atm
elementType: 8 8 8 8 8 8 7 6 6 6 6 6 6 6 6 6 6 6 6 6 6 6 6 6 6 6 6 6 1 1 1 1 1 1 1 1 1 1 1 1 1 1 1 1 1 1 1 1
symmnumber: 1
zpe: 985218.5 jmol-1
zpe.correction: 0.375250 hartree
zpe.thermalcorrener: 0.398670 hartree
zpe.thermalcorrenthalpy: 0.399614 hartree
zpe.thermalcorrgfe: 0.321891 hartree
zpe.sumelectzpe: -1316.024365 hartree
zpe.sumelectthermal: -1316.000945 hartree
zpe.sumelectthermalent: -1316.000001 hartree
zpe.sumelectthermalfe: -1316.077724 hartree
dipole: -7.8095 -3.9392 -5.8474
dipole: 10.5213
quadrupole: -83.7794 -120.6670 -158.6811
quadrupole: 23.8543 5.0259 11.7296
quadrupole: 37.2631 0.3755 -37.6386 23.8543 5.0259 11.7296
hfenergy: -1316.3996153 hartree
pointgroup: C01 [X(C21H20N1O6)]
dipole: -3.0593868 1.5712745 2.3034417 debye
polarizability: 285.9879958|-39.7466668|234.5088857|12.0990321|13.6729645|213.0030404 unknown
InChI: InChI=1S/C21H20NO6/c1-22(2)6-5-11-7-15-16(26-9-25-15)8-13(11)18(22)19-12-3-4-14-20(27-10-24-14)17(12)21(23)28-19/h3-4,7-8,18-19H,5-6,9-10H2,1-2H3
charge 1 multiplicity 1
48 atoms
O  -0.578997 1.871012 -1.313265
O  0.405919 -3.430911 1.378012
O  -0.927349 -4.40301 -0.370221
O  3.786075 0.39445 -1.522873
O  4.882344 0.446022 0.616139
O  0.830721 1.074749 -3.014636
N  -3.079364 1.677716 0.508312
C  -1.639577 1.133047 0.820655
C  -3.447629 1.3535 -0.962807
C  -0.528889 2.016834 0.15518
C  -1.554356 -0.349867 0.46758
C  -3.476703 -0.153214 -1.231672
C  -2.355175 -0.929171 -0.552538
C  -4.066718 1.020609 1.473559
C  -3.178818 3.187679 0.699218
C  0.88984 1.618608 0.544402
C  -0.602556 -1.137307 1.188388
C  -2.201161 -2.30466 -0.895023
C  1.568768 1.210345 -0.639369
C  -0.464523 -2.473501 0.826182
C  0.688499 1.320068 -1.816392
C  -1.247692 -3.047229 -0.203395
C  1.522172 1.664905 1.794739
C  2.907943 0.82503 -0.531522
C  3.544601 0.860651 0.73612
C  2.890755 1.272209 1.901796
C  0.143218 -4.697525 0.629049
C  5.098002 0.160001 -0.8302
H  -1.527733 1.269877 1.91507
H  -2.674146 1.841861 -1.574061
H  -4.429851 1.821116 -1.148734
H  -0.696044 3.084195 0.389434
H  -3.417637 -0.283899 -2.32816
H  -4.451436 -0.583644 -0.927663
H  -3.92993 -0.068315 1.452783
H  -3.8734 1.399563 2.48941
H  -5.09046 1.283531 1.165611
H  -2.734519 3.467255 1.667457
H  -2.666337 3.703908 -0.124056
H  -4.244109 3.465825 0.688934
H  0.008559 -0.71168 1.987516
H  -2.81414 -2.76354 -1.675644
H  0.99744 2.008867 2.692254
H  3.419489 1.299417 2.85741
H  -0.224161 -5.461722 1.332462
H  1.059498 -4.996209 0.095136
H  5.84028 0.865708 -1.235822
H  5.377889 -0.897357 -0.955956
