program: Gaussian 09
title: 000016184
version: EM64L-G09RevD.01
frameworkgroup: C1[X(C12H16N2O)]
method: RPBEPBE
basis: SDD
operation: Freq
keyword: #p
keyword: freq=noraman
keyword: PBEPBE/SDD
title: #p freq=noraman PBEPBE/SDD
converged: YES YES NO NO
title: Mulliken charges:
elementType: O N N C C C C C C C C C C C C H H H H H H H H H H H H H H H H
charge: -0.271592 -0.402873 -0.291915 0.384375 0.137889 -0.563287 0.214404 -0.441046 -0.367330 -0.565996 -0.321808 0.306201 -0.347504 -0.624716 -0.537256 0.232083 0.194846 0.221020 0.197253 0.268352 0.301889 0.243707 0.227433 0.246437 0.250261 0.226408 0.188479 0.220149 0.241372 0.216705 0.216059
chargesum: 0.00000
title: Mulliken charges with hydrogens summed into heavy atoms:
elementType: O N N C C C C C C C C C C C C
charge: -0.271592 -0.100984 -0.041654 0.384375 0.137889 -0.136358 0.214404 -0.172694 0.050943 -0.322289 -0.094374 0.306201 -0.101067 0.010320 0.136880
polarizability: 1.80079532e+02 1.06757091e+01 1.77833067e+02 -1.36568112e+01 4.75999293e+00 8.91190595e+01
1716.lowfreq: -8.2341 -0.0007 -0.0006 -0.0006 4.3906 8.9667 26.8577 56.4384 66.5664
frequency: 26.6539 56.4350 66.5577 90.1211 102.5537 149.9385 171.2438 173.5689 222.7475 244.4801 246.0061 273.1165 318.8566 365.3992 384.7911 424.1933 431.2200 480.1791 489.6390 507.8772 575.7223 596.1553 641.5444 654.8438 694.8023 746.1391 760.2519 790.4064 797.0130 804.6271 817.3781 840.4894 906.6697 933.5595 960.0784 996.2259 1002.0093 1034.8758 1057.8968 1093.7900 1106.0950 1114.8361 1127.5030 1133.5338 1155.9657 1163.3157 1190.2428 1207.7190 1242.5506 1248.3488 1273.0390 1292.6605 1305.9762 1320.0151 1363.2135 1395.5604 1422.1387 1433.0502 1438.2126 1447.8551 1461.8130 1463.9553 1464.4448 1469.4665 1477.0077 1479.2963 1489.4480 1498.4546 1561.4532 1594.7097 1632.8867 2854.0102 2867.2155 2948.4001 2954.3067 3007.5568 3009.7720 3031.1454 3046.5716 3071.5336 3117.2858 3134.6836 3153.5542 3170.1024 3219.2373 3442.2035 3616.4347
redmass: 3.3307 3.1984 1.8274 3.3231 2.7395 3.8985 2.7597 3.2826 1.5428 1.2760 1.8605 3.3927 4.3700 4.1123 4.8067 2.8838 4.0113 2.9704 1.3860 3.8548 4.4947 2.6339 2.1371 1.9259 3.7948 3.8643 3.2090 1.4064 1.5637 1.5465 3.3966 1.7538 4.7854 1.3292 2.1340 3.9796 1.9217 2.9150 2.5119 1.4981 1.2869 1.2625 1.7188 1.2529 1.3938 3.0769 2.7579 1.6020 2.2433 1.4889 1.2528 1.6254 2.2263 1.8212 1.4006 5.1500 1.9111 1.1491 1.5180 1.2053 2.6135 1.1293 1.0508 1.1425 1.2504 2.7580 1.0625 1.0693 6.3425 6.4352 7.0917 1.0698 1.0583 1.0336 1.0667 1.0856 1.0744 1.1034 1.0957 1.0995 1.0985 1.0893 1.0907 1.0955 1.0982 1.0744 1.0809
irintensity: 0.5675 0.4019 3.3007 9.9718 2.1291 0.0261 2.0208 2.9053 0.1443 2.4520 2.7994 6.0991 2.8931 0.8259 3.1466 8.2174 3.4739 19.3272 97.0460 2.4953 5.2878 7.3600 72.4362 63.6911 2.0518 1.5854 2.6336 30.1708 42.4360 10.3380 12.0457 32.9816 18.3659 0.0070 3.1207 40.0195 10.1263 4.3253 25.1122 29.5708 9.7808 0.2242 13.5832 1.1627 2.7098 40.9443 125.4756 23.4543 13.6058 17.0802 2.9558 10.6747 13.3991 9.1388 8.1122 18.8010 33.3468 1.6105 10.3495 23.8407 62.8625 4.9047 11.4719 10.7378 0.1526 90.5682 20.4129 5.2980 2.2577 24.3042 31.1919 80.1346 166.9158 56.7821 40.4098 29.1086 55.6249 55.7836 33.1510 42.3759 30.9591 13.4815 10.8935 9.0986 1.1942 1.8766 62.7452
temp: 298.150 k
press: 1.00000 atm
elementType: 8 7 7 6 6 6 6 6 6 6 6 6 6 6 6 1 1 1 1 1 1 1 1 1 1 1 1 1 1 1 1
symmnumber: 1
zpe: 679172.9 jmol-1
zpe.correction: 0.258683 hartree
zpe.thermalcorrener: 0.273574 hartree
zpe.thermalcorrenthalpy: 0.274518 hartree
zpe.thermalcorrgfe: 0.215867 hartree
zpe.sumelectzpe: -650.461021 hartree
zpe.sumelectthermal: -650.446130 hartree
zpe.sumelectthermalent: -650.445186 hartree
zpe.sumelectthermalfe: -650.503837 hartree
dipole: -0.7306 -0.5178 -0.0322
dipole: 0.8960
quadrupole: -95.9680 -67.2558 -92.9716
quadrupole: -8.9369 -0.2922 5.2027
quadrupole: -10.5695 18.1427 -7.5731 -8.9369 -0.2922 5.2027
hfenergy: -650.719704 hartree
pointgroup: C01 [X(C12H16N2O1)]
dipole: -0.2948384 -0.1930816 -0.0079044 debye
polarizability: 180.9745295|10.1412587|177.2744387|-13.4470927|2.6463201|88.7826904 unknown
InChI: InChI=1S/C12H16N2O/c1-13-6-5-9-8-14-12-4-3-10(15-2)7-11(9)12/h3-4,7-8,13-14H,5-6H2,1-2H3
charge 0 multiplicity 1
31 atoms
O  2.809692 2.251983 -0.109459
N  0.525734 -2.848424 -0.072854
N  -4.0908 0.991562 0.148104
C  -0.93767 -1.178223 0.490393
C  0.360476 -0.586603 0.208001
C  -2.201232 -0.452312 0.880873
C  1.256779 -1.654616 -0.140954
C  -0.791355 -2.555744 0.309069
C  -2.864587 0.301875 -0.299966
C  0.841815 0.753576 0.231102
C  2.611487 -1.418577 -0.468926
C  2.194118 0.981225 -0.093651
C  3.071227 -0.092242 -0.443268
C  -4.822005 1.70291 -0.91549
C  1.977743 3.397918 0.246282
H  -2.946223 -1.157062 1.293494
H  -1.979863 0.279724 1.687242
H  -3.144609 -0.429057 -1.083199
H  -2.117067 0.993301 -0.766471
H  -1.531501 -3.345442 0.42833
H  0.895291 -3.77809 -0.255365
H  0.169217 1.574135 0.498275
H  3.292258 -2.234624 -0.735289
H  4.109254 0.152664 -0.687245
H  -3.908117 1.593524 0.962432
H  -5.192937 0.973333 -1.659634
H  -4.213685 2.461466 -1.468952
H  -5.701763 2.215171 -0.486365
H  2.641196 4.27297 0.175813
H  1.586991 3.309433 1.279965
H  1.129137 3.517047 -0.457086
