program: Gaussian 09
title: 000106068
version: EM64L-G09RevD.01
frameworkgroup: C1[X(C21H22BrN7O6)]
method: RPBEPBE
basis: SDD
operation: Freq
keyword: #p
keyword: freq=noraman
keyword: PBEPBE/SDD
title: #p freq=noraman PBEPBE/SDD
converged: YES YES NO NO
title: Mulliken charges:
elementType: Br O O O O O O N N N N N N N C C C C C C C C C C C C C C C C C C C C C H H H H H H H H H H H H H H H H H H H H H H
charge: 0.054793 -0.294078 -0.269954 -0.202823 -0.179407 -0.201902 -0.208003 -0.145487 -0.435883 -0.092735 -0.104206 -0.004743 0.014198 0.014567 0.377923 -0.455104 -0.355203 0.240052 -0.495078 0.334343 -0.417789 -0.377201 -0.078950 -0.659862 -0.240193 -0.143454 0.219216 -0.684552 0.239424 0.315433 -0.776197 -0.292697 -0.528503 0.450507 -0.363619 0.276073 0.257749 0.211712 0.268448 0.317488 0.295214 0.250049 0.299756 0.249014 0.212138 0.220364 0.361720 0.220774 0.229387 0.224083 0.227680 0.226900 0.259905 0.231483 0.261774 0.335015 0.310442
chargesum: 0.00000
title: Mulliken charges with hydrogens summed into heavy atoms:
elementType: Br O O O O O O N N N N N N N C C C C C C C C C C C C C C C C C C C C C
charge: 0.054793 -0.294078 -0.269954 -0.202823 -0.179407 -0.201902 -0.208003 -0.145487 -0.074164 -0.092735 -0.104206 -0.004743 0.014198 0.014567 0.377923 0.078717 0.124957 0.240052 -0.177591 0.334343 0.127473 -0.077445 -0.078950 0.021655 0.209969 -0.143454 0.219216 -0.005889 0.239424 0.315433 -0.023035 -0.292697 -0.193488 0.450507 -0.053176
polarizability: 8.85790675e+02 1.44906525e+01 3.76277764e+02 1.86935896e+01 2.31862407e+01 2.05848965e+02
1716.lowfreq: -7.2208 -4.0672 -2.2937 0.0005 0.0007 0.0007 9.4076 13.0955 17.1457
frequency: 8.7915 12.9721 16.9752 18.9365 25.9083 33.6714 43.9611 50.8990 53.6797 58.6589 59.8159 77.4873 80.3700 89.4617 96.0852 101.7386 109.3362 112.5055 120.9547 126.4954 136.9239 140.6501 163.4722 177.7904 184.1098 191.8997 202.3980 214.0108 231.3901 243.1317 246.1824 263.3040 271.4496 282.5631 299.1351 311.5027 336.8422 338.7752 343.3800 352.2139 362.3751 370.7195 406.9901 418.0303 445.2687 463.2865 483.4500 486.8228 499.5703 516.3906 517.3974 522.2953 537.0283 570.9856 593.7816 600.3576 618.9376 650.6624 660.4253 672.5057 680.2893 699.1193 703.9023 718.6845 725.5651 748.7027 757.3843 773.0827 779.6489 789.4320 817.0060 820.3797 828.9777 852.3412 872.3678 887.4164 889.4454 900.2466 931.6447 935.6789 939.4841 947.6693 954.2114 985.2021 1000.9090 1002.5699 1028.2771 1038.3417 1042.0158 1052.4585 1081.7805 1097.5795 1113.9261 1118.6514 1135.7164 1136.7626 1148.8916 1169.7374 1182.6111 1187.4353 1195.8654 1209.3144 1227.1909 1239.1563 1254.4267 1268.6225 1271.3053 1288.9948 1293.9004 1308.1976 1335.0802 1346.4860 1352.0179 1355.4608 1364.1230 1364.4289 1379.7593 1381.3513 1386.9751 1391.0329 1396.7441 1403.0629 1408.5631 1435.2186 1448.1036 1451.0847 1455.6686 1463.6538 1465.5639 1469.3697 1471.6866 1477.5945 1481.8015 1485.2452 1489.1855 1514.6474 1522.4732 1549.1339 1562.2739 1584.1588 1606.6073 1618.9480 2201.3855 2970.1739 2986.3802 2990.3239 2997.6966 2998.8011 3004.1992 3029.6510 3032.2970 3062.6159 3076.8591 3092.7113 3093.8436 3095.7992 3104.4738 3109.4409 3110.1941 3133.4834 3182.9572 3184.0026 3193.7416 3210.0444 3420.8474
redmass: 9.6232 7.4982 4.8679 7.8123 8.3738 8.8067 4.1686 2.5358 2.3252 8.7547 4.7930 4.1506 4.9091 3.6768 3.4452 3.6072 7.8188 5.1571 1.8653 4.4974 9.7245 7.6575 6.5512 3.5973 4.7279 5.0898 1.5147 5.1777 2.5548 1.5815 3.4357 12.5113 4.2458 3.7824 8.2567 9.5128 7.6805 8.4749 3.1943 5.5446 3.5519 5.5567 6.0516 4.8646 4.0306 5.2071 5.3237 4.9091 4.9989 5.0064 4.9023 5.6964 4.2618 6.1520 3.5414 4.5074 5.5377 6.0179 8.8481 10.0765 11.2145 6.5319 8.7153 4.6199 5.8062 2.7147 6.4114 4.0678 1.5799 1.2091 1.1745 6.9877 1.1428 3.7788 3.1783 1.5493 9.9104 1.4654 1.4493 5.0904 3.1670 3.4876 1.4471 3.5787 2.1828 2.2709 2.5748 2.0710 1.6439 2.3872 2.0733 2.4610 2.1474 3.9646 1.4498 2.7217 3.3803 2.0069 2.4013 3.5218 3.4451 4.6043 2.4311 1.9351 1.7073 1.1347 1.4449 1.4047 1.2013 2.0965 3.8792 1.3003 6.6351 1.4328 1.5139 8.7857 3.2587 3.1265 1.2157 1.2683 2.3693 1.5994 5.8810 5.8536 1.2725 1.0839 1.6047 1.0472 1.0741 1.1095 1.3052 1.1210 1.2672 1.3953 1.1516 1.5802 3.4797 9.9933 4.6326 7.7034 5.1944 6.1092 12.4362 1.0558 1.0587 1.0490 1.0362 1.0363 1.0599 1.0602 1.1078 1.1000 1.0989 1.1058 1.0983 1.0989 1.1018 1.0981 1.1005 1.0937 1.0900 1.0926 1.0927 1.0910 1.0768
irintensity: 1.0816 0.4554 0.7906 0.9641 1.4962 2.1570 0.1600 0.9962 1.1626 0.0641 1.0109 9.2784 2.0711 2.3472 1.4513 4.3992 2.0760 8.3356 6.2753 2.1226 2.3897 7.0293 4.1238 4.0523 0.5424 0.6034 5.0224 7.8863 1.4409 1.1924 0.5625 1.0408 1.0126 0.5075 4.6897 6.1848 1.3090 12.7340 2.8428 3.8157 1.7596 5.5949 5.7596 14.9347 3.4598 7.2795 2.9435 31.4332 12.1942 5.6876 23.2051 1.7523 16.0389 26.4293 0.3403 2.8993 19.7441 33.9531 2.3641 21.9063 48.2356 4.1935 32.0689 7.7785 5.9729 2.1873 52.0658 9.0239 17.8925 43.3084 52.8819 68.3228 6.9479 46.2593 11.1694 7.8241 56.8616 40.1040 22.6562 8.3222 8.1565 9.8457 20.9544 31.9949 59.5773 33.9607 54.4512 0.6323 13.2076 108.1095 45.4838 141.2586 4.1293 9.9499 4.7101 93.6281 42.3792 22.7935 185.9501 268.7358 846.8065 1181.9287 50.7294 98.2195 10.9912 0.7163 174.6510 179.2460 28.3164 380.9978 42.7691 0.4687 201.4838 265.0620 52.2951 100.6335 33.6562 249.3597 22.3251 140.8537 562.9854 144.8663 346.8719 29.5423 198.0919 13.4011 273.5618 24.6449 7.9535 9.6256 132.3774 13.7184 15.2983 30.5899 23.8889 69.6736 485.1951 25.1070 217.8151 249.6638 108.8089 364.9726 23.1775 11.5887 34.7581 78.2927 21.4997 4.3104 4.1845 35.5692 17.5335 0.4444 27.5296 7.9374 7.4746 16.9579 30.6786 35.6689 10.3908 6.7169 8.2323 8.4580 26.5924 12.6314 53.3058
temp: 298.150 k
press: 1.00000 atm
elementType: 35 8 8 8 8 8 8 7 7 7 7 7 7 7 6 6 6 6 6 6 6 6 6 6 6 6 6 6 6 6 6 6 6 6 6 1 1 1 1 1 1 1 1 1 1 1 1 1 1 1 1 1 1 1 1 1 1
symmnumber: 1
zpe: 1096730.7 jmol-1
zpe.correction: 0.417723 hartree
zpe.thermalcorrener: 0.453546 hartree
zpe.thermalcorrenthalpy: 0.454490 hartree
zpe.thermalcorrgfe: 0.342780 hartree
zpe.sumelectzpe: -1658.722114 hartree
zpe.sumelectthermal: -1658.686291 hartree
zpe.sumelectthermalent: -1658.685347 hartree
zpe.sumelectthermalfe: -1658.797057 hartree
dipole: -6.8882 3.1123 -2.4005
dipole: 7.9307
quadrupole: -294.2359 -207.1485 -216.4314
quadrupole: -51.2940 3.2710 -12.3799
quadrupole: -54.9640 32.1234 22.8406 -51.2940 3.2710 -12.3799
hfenergy: -1659.1398369 hartree
pointgroup: C01 [X(C21H22Br1N7O6)]
dipole: -2.7181762 1.3886435 -0.6470393 debye
polarizability: 881.5346204|18.2698146|346.651144|51.7719303|70.7394323|239.7316393 unknown
InChI: InChI=1S/C21H22BrN7O6/c1-4-27(8-6-7-23)18-11-16(24-13(3)30)17(12-20(18)35-5-2)25-26-21-15(22)9-14(28(31)32)10-19(21)29(33)34/h9-12,24H,4-6,8H2,1-3H3
charge 0 multiplicity 1
57 atoms
Br 2.841098 -1.633376 -2.270959
O  -2.822439 2.618376 -0.03643
O  -2.78646 -3.945473 -0.831035
O  4.01385 2.350609 2.851394
O  2.159955 1.025799 2.698687
O  8.100537 0.65003 0.817565
O  7.960672 -0.659848 -1.052665
N  -4.645882 0.4386 -0.536114
N  -0.846295 -2.663667 -0.528088
N  0.871876 -0.683822 -0.031401
N  1.737432 0.269277 0.236955
N  -7.956751 -3.192038 -0.773463
N  3.330758 1.398585 2.299957
N  7.427942 0.000307 -0.074987
C  -3.275371 0.241095 -0.401398
C  -5.512681 -0.650949 -1.035907
C  -5.403661 1.659796 -0.132552
C  -2.314758 1.31407 -0.134909
C  -2.75392 -1.082128 -0.550181
C  -1.387004 -1.369284 -0.419432
C  -5.990827 -1.619526 0.098102
C  -0.955829 1.026736 -0.02138
C  -0.458028 -0.302469 -0.150197
C  -5.734363 2.589485 -1.317726
C  -1.857102 3.720399 0.197343
C  -7.072913 -2.498815 -0.371057
C  -1.524393 -3.869947 -0.714006
C  -2.66073 5.015687 0.254251
C  3.102416 0.021484 0.191548
C  3.943182 0.697447 1.150914
C  -0.633789 -5.104567 -0.75002
C  3.803226 -0.683657 -0.852372
C  5.342248 0.718063 1.073273
C  5.9574 0.013421 0.024685
C  5.198602 -0.690997 -0.940699
H  -5.003839 -1.223752 -1.828519
H  -6.400558 -0.182786 -1.494445
H  -6.342079 1.308494 0.341027
H  -4.830673 2.208238 0.625032
H  -3.406887 -1.929868 -0.745818
H  -5.152622 -2.239184 0.463375
H  -6.362068 -1.028019 0.956563
H  -0.218016 1.806289 0.18099
H  -4.806008 2.993509 -1.752347
H  -6.298525 2.063964 -2.109859
H  -6.354275 3.43475 -0.966957
H  0.17788 -2.671962 -0.417995
H  -1.122451 3.733547 -0.632553
H  -1.319638 3.533399 1.148085
H  -1.976997 5.868246 0.416082
H  -3.206719 5.184393 -0.689715
H  -3.387671 4.995214 1.084148
H  -0.826668 -5.716555 0.149144
H  0.443109 -4.869627 -0.793933
H  -0.906475 -5.717598 -1.625047
H  5.935342 1.256771 1.815819
H  5.722136 -1.226163 -1.736772
