program: Gaussian 09
title: 000102170
version: EM64L-G09RevD.01
frameworkgroup: C1[X(C13H8F16O2)]
method: RPBEPBE
basis: SDD
operation: Freq
keyword: #p
keyword: freq=noraman
keyword: PBEPBE/SDD
title: #p freq=noraman PBEPBE/SDD
converged: YES YES NO NO
title: Mulliken charges:
elementType: F F F F F F F F F F F F F F F F O O C C C C C C C C C C C C C H H H H H H H H
charge: -0.129478 -0.110619 -0.135098 -0.114673 -0.128788 -0.120770 -0.124635 -0.130048 -0.116671 -0.122965 -0.144161 -0.155112 -0.125688 -0.136041 -0.152076 -0.156221 -0.270494 -0.226721 0.262104 0.247577 0.170343 0.230254 0.222189 0.305272 0.287794 -0.385668 0.082812 0.171259 0.353714 -0.749197 -0.614672 0.286270 0.275465 0.250480 0.242924 0.249694 0.218293 0.235696 0.257658
chargesum: 0.00000
title: Mulliken charges with hydrogens summed into heavy atoms:
elementType: F F F F F F F F F F F F F F F F O O C C C C C C C C C C C C C
charge: -0.129478 -0.110619 -0.135098 -0.114673 -0.128788 -0.120770 -0.124635 -0.130048 -0.116671 -0.122965 -0.144161 -0.155112 -0.125688 -0.136041 -0.152076 -0.156221 -0.270494 -0.226721 0.262104 0.247577 0.170343 0.230254 0.222189 0.305272 0.287794 0.176067 0.333292 0.171259 0.353714 -0.038286 -0.121319
polarizability: 2.05677936e+02 -7.42873268e+00 1.39250048e+02 1.09478732e+01 7.01080469e+00 1.27983848e+02
1716.lowfreq: -8.1641 -3.3498 0.0005 0.0008 0.0008 4.0264 15.8964 17.7958 27.2523
frequency: 15.6819 17.7375 27.2331 28.6961 41.8519 48.6258 54.5391 66.8955 68.6823 73.2546 87.6685 99.8449 108.7879 117.6775 134.4357 157.2167 167.8063 177.0287 179.2164 202.7357 203.7090 218.7968 226.3091 234.6567 244.6286 251.8751 260.0615 260.6484 271.0010 279.5963 287.7542 293.5369 299.3704 300.0649 310.3538 314.6460 338.3006 341.1813 359.5289 372.5484 382.0349 395.0512 406.3117 420.6060 440.3011 462.1531 490.6304 502.4099 512.1949 521.4395 557.2249 566.4603 574.2910 581.5520 585.8482 615.0542 626.7049 706.2741 728.3903 761.6680 780.5369 790.2299 842.8552 893.1187 906.2282 931.0941 955.9394 969.8867 986.3429 994.3015 998.4214 1008.3178 1010.9182 1016.5205 1021.9052 1027.2425 1035.9564 1038.7243 1046.6357 1055.2647 1067.4498 1074.7089 1092.5319 1098.8279 1122.1116 1139.2558 1144.6374 1152.2258 1162.5441 1169.8915 1188.0887 1270.3187 1291.2656 1295.1149 1341.5237 1367.6380 1400.2509 1418.5226 1437.7033 1457.8560 1472.0029 1631.7676 1655.8155 2993.6537 3024.1070 3077.9518 3092.7283 3102.9019 3107.9936 3116.8923 3220.3211
redmass: 7.2796 8.8893 12.3420 5.0524 7.4196 7.7611 9.5346 11.1637 7.5198 9.2398 12.3227 17.5083 15.5030 10.7489 15.1324 10.8289 14.9399 5.8827 1.1872 7.7240 7.3602 13.3941 16.4811 11.7943 17.3874 16.2601 16.1062 13.9769 18.3248 16.0733 16.9538 15.3764 14.3480 16.7735 6.7106 16.3279 16.9825 13.0009 5.8228 3.5370 4.2235 3.5336 9.6832 11.7914 13.4406 14.8578 5.9517 12.3928 9.7806 15.6723 15.3444 8.6349 14.9061 6.4757 8.5020 16.8907 1.5528 7.0754 7.8149 5.6604 2.0796 9.8905 11.1948 3.6594 9.7129 2.4880 8.7389 10.1638 6.6109 8.9749 1.3133 10.0845 1.4099 9.6101 9.1428 10.5533 11.5906 8.4941 12.3487 1.5075 10.7619 4.8338 3.9723 5.3172 11.6650 10.1148 10.0026 11.1963 7.3160 9.6089 10.8288 1.2265 3.1003 1.1874 1.3250 1.3413 1.1682 1.2517 1.0911 1.0441 1.0601 8.1165 6.0138 1.0363 1.0610 1.0973 1.0882 1.1008 1.0622 1.1024 1.1159
irintensity: 0.0689 0.0718 0.0539 0.5505 0.1055 1.0560 1.9551 0.4382 1.7183 1.3368 0.2880 0.4115 0.9992 1.9951 1.3640 1.3238 5.6574 1.2881 0.2735 5.9163 5.4213 11.9060 2.0950 2.6567 0.3421 1.8276 1.1894 2.8126 1.9656 3.2113 1.2547 2.4709 1.2652 0.9031 3.1276 0.6042 1.6029 2.3695 6.1659 8.7526 3.4680 7.7517 1.7251 3.9476 3.2680 12.1789 14.4083 11.9701 8.0639 14.2839 5.8061 5.6310 8.6962 4.5335 4.1040 1.8570 8.9087 58.2736 142.6169 58.1039 7.3561 177.9270 67.7169 98.8702 71.7923 7.5777 42.2830 125.9268 57.6222 8.9483 54.4737 23.3574 11.9764 9.4393 55.0509 38.7359 139.4527 47.3246 174.9119 7.7718 455.1386 308.9069 20.5768 63.9989 21.2120 51.9845 53.9716 6.0868 16.1381 14.6544 4.3183 33.5262 53.8594 3.0738 5.7708 37.7586 23.1973 11.5276 21.5309 16.0239 45.8513 119.4931 21.3428 12.5062 38.1966 12.9885 10.4703 23.3990 3.3917 0.4883 4.0556
temp: 298.150 k
press: 1.00000 atm
elementType: 9 9 9 9 9 9 9 9 9 9 9 9 9 9 9 9 8 8 6 6 6 6 6 6 6 6 6 6 6 6 6 1 1 1 1 1 1 1 1
symmnumber: 1
zpe: 549563.4 jmol-1
zpe.correction: 0.209318 hartree
zpe.thermalcorrener: 0.241429 hartree
zpe.thermalcorrenthalpy: 0.242373 hartree
zpe.thermalcorrgfe: 0.143219 hartree
zpe.sumelectzpe: -2245.630886 hartree
zpe.sumelectthermal: -2245.598775 hartree
zpe.sumelectthermalent: -2245.597831 hartree
zpe.sumelectthermalfe: -2245.696985 hartree
dipole: -3.3582 1.7851 3.3575
dipole: 5.0732
quadrupole: -167.9850 -175.0069 -180.8195
quadrupole: -9.6737 -3.8741 2.9238
quadrupole: 6.6188 -0.4031 -6.2157 -9.6737 -3.8741 2.9238
hfenergy: -2245.8402041 hartree
pointgroup: C01[X(C13H8F16O2)]
dipole: -1.3282596 0.6557925 1.3376909 debye
polarizability: 205.953102|-6.5774626|138.7510023|10.4927397|7.4087041|128.2077272 unknown
InChI: InChI=1S/C13H8F16O2/c1-4(2)5(30)31-3-7(16,17)9(20,21)11(24,25)13(28,29)12(26,27)10(22,23)8(18,19)6(14)15/h6H,1,3H2,2H3
charge 0 multiplicity 1
39 atoms
F  -0.02138 -0.36821 1.933103
F  1.45205 -2.093723 1.758594
F  -0.847639 -2.565354 0.516965
F  0.919595 -2.391946 -0.924763
F  2.587932 0.342804 2.042023
F  1.481072 1.21837 0.257521
F  0.003337 0.066694 -1.832879
F  -1.447442 -1.694272 -1.980892
F  2.788525 -0.367876 -1.506052
F  3.618513 -1.721228 0.135649
F  -2.671122 0.683009 -1.623813
F  -1.43378 1.194368 0.219615
F  5.395964 0.08746 -1.095288
F  5.173773 0.215799 1.173815
F  5.611843 2.651344 -0.11896
F  3.704139 2.377352 -1.363165
O  -4.147938 0.297533 0.66646
O  -5.554518 -1.003358 -0.680905
C  0.884696 -1.011385 1.049538
C  0.034163 -1.643908 -0.120036
C  2.044431 0.023124 0.767343
C  -0.856265 -0.765185 -1.082452
C  3.238132 -0.395436 -0.169271
C  -2.025851 0.108004 -0.492594
C  4.533554 0.505173 -0.05925
C  -3.054782 -0.629844 0.372286
C  4.331663 2.047566 -0.135172
C  -5.392566 0.014812 0.025746
C  -6.393562 1.076925 0.3459
C  -5.970909 2.257566 1.193916
C  -7.645072 0.912089 -0.168039
H  -3.438765 -1.513506 -0.170108
H  -2.606596 -0.923056 1.333362
H  3.739855 2.449748 0.703748
H  -5.618864 1.929566 2.188083
H  -5.129552 2.79937 0.726403
H  -6.811767 2.95793 1.32923
H  -8.434671 1.648397 0.014795
H  -7.889399 0.037484 -0.780654
