program: Gaussian 09
title: 000100252
version: EM64L-G09RevD.01
frameworkgroup: C1[X(C8H13N4O8P)]
method: RPBEPBE
basis: SDD
operation: Freq
keyword: #p
keyword: freq=noraman
keyword: PBEPBE/SDD
title: #p freq=noraman PBEPBE/SDD
converged: YES YES NO NO
title: Mulliken charges:
elementType: P O O O O O O O O N N N N C C C C C C C C H H H H H H H H H H H H H
charge: 1.407923 -0.239168 -0.492824 -0.446981 -0.561229 -0.690553 -0.731269 -0.596869 -0.333137 -0.100216 -0.012419 -0.150749 -0.594897 -0.186354 -0.140755 -0.075940 -0.055001 -0.254013 -0.162565 -0.016146 0.281461 0.280268 0.326719 0.252504 0.230332 0.233344 0.260113 0.367400 0.370461 0.284730 0.392692 0.432959 0.370014 0.350164
chargesum: 0.00000
title: Mulliken charges with hydrogens summed into heavy atoms:
elementType: P O O O O O O O O N N N N C C C C C C C C
charge: 1.407923 -0.239168 -0.125424 -0.076520 -0.561229 -0.297861 -0.298309 -0.596869 -0.333137 -0.100216 -0.012419 -0.150749 0.125281 0.093914 0.185964 0.176563 0.175331 0.239444 0.122165 -0.016146 0.281461
polarizability: 1.99176410e+02 -3.57720337e+00 1.72116916e+02 7.28337803e+00 -7.85409522e+00 1.11014762e+02
1716.lowfreq: -6.5967 0.0014 0.0015 0.0020 5.9840 8.3664 22.6321 50.5923 57.8556
frequency: 22.4758 50.5543 57.8468 72.3020 76.5728 89.6228 103.5758 122.9388 129.0575 147.8011 171.4599 184.9288 217.6961 222.8347 231.5070 253.7756 261.1608 280.3191 307.0276 337.1997 349.1891 362.8615 368.7145 382.0415 396.9157 420.3067 434.1741 512.7696 526.1334 557.4679 575.5702 588.8081 640.5909 652.0498 661.7801 668.3257 681.1943 691.6282 703.7678 752.5740 774.3166 795.3473 817.9723 831.5171 833.6786 856.8877 921.1573 951.7167 967.9823 976.8696 994.2931 1002.9855 1010.3463 1021.5080 1030.4734 1051.4032 1056.7419 1080.6711 1086.5600 1091.2833 1161.5046 1163.3243 1168.0832 1209.5232 1223.0687 1239.9784 1260.5174 1261.1653 1273.3717 1278.3012 1307.9241 1314.4974 1321.9865 1329.3713 1346.5404 1367.0911 1376.1827 1386.7314 1418.8361 1458.9671 1491.3206 1575.1597 1631.8614 2617.2961 2998.6151 3035.0411 3051.4950 3069.7754 3073.4831 3103.6158 3253.5020 3423.4997 3496.2976 3602.7071 3621.2776 3662.1852
redmass: 8.5409 5.6356 7.3675 4.7629 7.6063 6.7368 7.6258 5.2847 5.1452 8.6797 2.9675 6.7200 1.8808 2.9178 2.5648 3.7497 8.1794 6.0813 4.2948 4.4539 3.8363 8.0183 7.0786 3.8512 4.8371 9.0323 5.6470 6.2724 3.5874 1.2566 1.5426 4.9378 4.9331 5.1648 4.0526 1.4458 1.9583 6.4067 5.3919 6.3857 12.0049 4.4837 7.0922 1.8486 3.0541 3.0381 4.4338 7.2369 2.3358 4.8737 4.2406 3.9963 1.1918 1.3375 3.7417 2.6279 3.6455 3.9037 2.0336 2.6196 3.0852 1.2625 1.6569 1.1294 1.4277 1.5463 1.5467 4.6016 1.3183 1.0870 1.7978 1.4571 2.7117 3.8477 1.3528 1.3745 1.2182 1.6578 2.7766 1.0759 4.3756 1.8111 3.2328 1.0858 1.0575 1.0860 1.0875 1.0968 1.0976 1.0879 1.1009 1.0639 1.0467 1.0659 1.0673 1.1040
irintensity: 3.0600 6.3487 1.4250 10.0518 0.6129 0.1879 2.9122 11.8131 29.5870 7.7705 30.8698 1.2414 32.6951 58.2493 38.8658 37.5784 3.0245 1.4274 8.0912 6.2627 56.5881 19.9193 5.5268 52.5893 31.9343 10.3466 35.2591 0.8924 16.2587 100.3591 51.5293 28.3012 3.8109 8.2487 11.2374 3.9643 237.2108 149.8887 182.7756 90.0968 7.5250 0.9085 100.3968 34.3363 43.5343 11.9573 73.4399 15.2115 3.6353 75.5119 102.3005 39.0169 156.9336 89.1241 159.9832 60.6528 134.6880 99.2401 4.5134 41.9262 66.8884 23.2838 6.0417 7.4176 44.1573 5.6595 7.0181 88.7487 2.6206 93.2855 6.7742 2.7889 12.6624 10.3270 4.0174 5.5685 71.3855 30.5976 51.0882 12.7552 54.5792 165.7933 597.4161 2409.6011 24.6933 22.9465 25.9290 3.5933 23.9114 3.2669 1.6523 65.8359 81.0672 56.4145 31.2738 82.1578
temp: 298.150 k
press: 1.00000 atm
elementType: 15 8 8 8 8 8 8 8 8 7 7 7 7 6 6 6 6 6 6 6 6 1 1 1 1 1 1 1 1 1 1 1 1 1
symmnumber: 1
zpe: 633992.9 jmol-1
zpe.correction: 0.241475 hartree
zpe.thermalcorrener: 0.262232 hartree
zpe.thermalcorrenthalpy: 0.263176 hartree
zpe.thermalcorrgfe: 0.191613 hartree
zpe.sumelectzpe: -1473.042570 hartree
zpe.sumelectthermal: -1473.021813 hartree
zpe.sumelectthermalent: -1473.020869 hartree
zpe.sumelectthermalfe: -1473.092432 hartree
dipole: -1.5989 -3.8729 -3.5830
dipole: 5.5131
quadrupole: -90.3518 -124.2978 -144.3287
quadrupole: -13.6101 3.1518 -9.0817
quadrupole: 29.3077 -4.6383 -24.6693 -13.6101 3.1518 -9.0817
hfenergy: -1473.284045 hartree
pointgroup: C01 [X(C8H13N4O8P1)]
dipole: -0.9384328 0.926178 -1.7222443 debye
polarizability: 182.2670499|12.0219727|185.7798634|-7.7681519|-18.3578163|114.2611745 unknown
InChI: InChI=1S/C8H13N4O8P/c9-6(15)7-10-2-12(11-7)8-5(14)4(13)3(20-8)1-19-21(16,17)18/h2-5,8,13-14,16-17H,1,9H2
charge 0 multiplicity 1
34 atoms
P  2.093961 -1.576952 1.221234
O  0.107845 1.511622 -1.637159
O  1.452932 4.008436 -0.415674
O  -0.434911 3.505469 1.319585
O  1.947308 0.017213 0.574283
O  3.706681 -1.899979 0.683053
O  1.277557 -2.671317 0.23941
O  1.803395 -1.558386 2.774994
O  -1.130425 -3.365297 0.720329
N  -1.663152 0.734973 -0.223238
N  -1.137452 -0.506035 0.101502
N  -3.459703 -0.552411 0.127324
N  -3.44301 -3.240436 0.879728
C  1.495838 2.596532 0.012741
C  0.105357 2.336262 0.664663
C  1.532293 1.631373 -1.192138
C  -0.777007 1.874905 -0.545597
C  2.153086 0.264499 -0.866291
C  -3.046324 0.689053 -0.205497
C  -2.260927 -1.249269 0.297985
C  -2.215458 -2.691831 0.648028
H  2.313381 2.410228 0.728532
H  0.1889 1.527815 1.405014
H  2.059279 2.07607 -2.054582
H  -1.443761 2.697033 -0.863889
H  3.24066 0.269984 -1.069049
H  1.664723 -0.521944 -1.470304
H  2.363492 4.384888 -0.467403
H  -0.035453 4.291147 0.847393
H  -3.683255 1.541086 -0.424753
H  3.894103 -2.865264 0.565254
H  0.277158 -2.90101 0.444182
H  -4.273098 -2.649162 0.795327
H  -3.516015 -4.226097 1.127509
