program: Gaussian 09
title: 000100461
version: EM64L-G09RevD.01
frameworkgroup: C1[X(C14H18N10O4)]
method: RPBEPBE
basis: SDD
operation: Freq
keyword: #p
keyword: freq=noraman
keyword: PBEPBE/SDD
title: #p freq=noraman PBEPBE/SDD
converged: YES YES NO NO
title: Mulliken charges:
elementType: O O O O N N N N N N N N N N C C C C C C C C C C C C C C H H H H H H H H H H H H H H H H H H
charge: -0.214024 -0.213786 -0.246357 -0.245895 -0.084432 -0.109150 0.021241 0.024227 -0.179041 -0.177180 -0.098470 -0.097757 0.048390 0.048703 -0.406835 -0.384344 -0.342897 -0.348089 -0.327921 -0.330251 0.211716 0.209212 0.320501 0.320978 -0.627490 -0.627777 -0.348729 -0.348731 0.231526 0.253562 0.233227 0.250836 0.250557 0.236394 0.245845 0.234021 0.236680 0.239596 0.249311 0.242514 0.286661 0.246894 0.246426 0.286215 0.292006 0.291916
chargesum: 0.00000
title: Mulliken charges with hydrogens summed into heavy atoms:
elementType: O O O O N N N N N N N N N N C C C C C C C C C C C C C C
charge: -0.214024 -0.213786 -0.246357 -0.245895 -0.084432 -0.109150 0.021241 0.024227 -0.179041 -0.177180 -0.098470 -0.097757 0.048390 0.048703 0.078252 0.099720 0.144055 0.131778 -0.091240 -0.090655 0.211716 0.209212 0.320501 0.320978 0.150995 0.151757 -0.056723 -0.056815
polarizability: 6.25719489e+02 -9.98328710e+00 2.40204392e+02 2.49627524e+01 7.15429290e+00 1.73652538e+02
1716.lowfreq: -12.6846 -3.6025 -2.4233 -0.0006 0.0005 0.0009 6.3112 20.1572 22.7044
frequency: 6.2879 20.1121 22.6906 30.7005 46.3484 50.0330 53.0785 53.5217 70.4217 73.2824 118.3186 135.9777 148.0704 151.5372 169.0143 179.6406 216.7518 227.9730 236.8826 239.2179 244.5867 276.4736 295.7572 303.9728 319.8455 327.0460 348.0768 356.9035 368.9637 376.1929 410.3814 431.9208 444.8665 452.3797 471.1596 487.4554 506.2465 571.0456 578.8801 587.2697 587.9984 606.0903 678.3270 679.7326 681.1435 682.0967 715.4797 716.4976 739.0711 742.1164 748.8037 774.4693 817.3861 837.3535 845.6654 876.7291 877.0409 888.7801 889.5573 930.1590 933.1773 949.3493 974.3843 992.4062 1037.4404 1045.0310 1102.4454 1103.4279 1117.3124 1132.5793 1132.9474 1133.0953 1141.7312 1150.9753 1151.2092 1187.4717 1188.9687 1190.1744 1210.0518 1211.0596 1228.2333 1262.7030 1271.0438 1283.6482 1290.1874 1315.2344 1316.8316 1320.5993 1329.6312 1337.2245 1338.2632 1341.5415 1348.3616 1353.8636 1359.2046 1363.5122 1389.3718 1392.7237 1436.9257 1439.1940 1448.6298 1457.7714 1458.8343 1460.6648 1467.8460 1472.5758 1472.9775 1474.3908 1483.5258 1484.0057 1486.6423 1490.2420 1578.8182 1582.8043 2944.8863 2948.6074 3015.2130 3018.6659 3018.8083 3022.9414 3060.3237 3077.1821 3084.2856 3090.4838 3101.8743 3108.3859 3108.4115 3112.6662 3157.2039 3157.2315 3253.7036 3253.9478
redmass: 8.9374 6.0685 6.6638 6.8170 8.0578 9.8475 5.0440 5.0658 4.3978 5.1438 1.0975 3.7558 1.3775 2.4181 4.7261 4.5747 7.0244 4.4336 4.6259 5.2714 3.7841 3.5126 4.4606 3.6890 3.3998 3.2569 4.3834 4.1182 4.1363 6.8915 8.2612 3.8053 3.8217 4.3860 4.0826 5.2361 5.3003 4.8250 4.4084 4.9010 4.8790 2.3254 5.5494 5.4162 7.8103 7.7763 8.4150 8.4074 6.8322 10.9643 6.5980 3.7809 1.8123 4.7712 3.7157 1.4008 1.3981 1.4856 1.4744 3.1953 3.1792 2.2991 2.6554 2.7008 1.7817 2.5232 3.1451 3.2441 2.3345 2.5025 1.4600 1.3170 2.0921 2.1358 2.2787 1.4179 2.6114 2.9644 3.7895 4.1094 2.6745 2.2379 3.1980 1.6705 1.7060 4.6023 7.7936 2.0748 1.4681 4.0520 3.6998 1.5498 1.5869 1.9223 1.4058 1.8256 2.4543 2.1125 1.9273 2.0189 1.1377 1.4811 3.0540 1.6109 1.1112 1.4172 1.4242 1.2341 1.3204 1.6658 1.7761 1.3117 6.3616 6.2115 1.0677 1.0695 1.0648 1.0341 1.0343 1.0644 1.0939 1.0873 1.0867 1.0925 1.0997 1.1015 1.1013 1.1002 1.1020 1.1019 1.0994 1.0994
irintensity: 1.8625 0.7076 1.0262 2.4293 0.5814 0.3313 4.0919 0.6539 0.4632 0.5172 0.1575 0.4508 1.7040 3.6205 6.8890 4.4038 1.3219 12.6934 2.5997 10.6664 17.2287 4.1782 0.3089 9.8168 2.2096 17.0140 5.0863 6.2885 0.7596 14.4106 1.5231 10.1490 13.8790 44.8778 4.0366 2.9385 6.6531 0.3657 0.7424 0.3197 0.1994 24.7357 1.7787 1.8716 12.1875 12.3370 0.7160 1.1975 2.1081 10.3960 1.6784 2.0384 2.0260 14.9687 3.2803 17.3732 18.3314 9.6618 71.7356 10.5103 1.3277 1.9715 445.2908 74.0116 9.5669 22.6234 233.9512 17.2890 262.0052 49.2221 10.1694 0.5461 23.8541 33.7072 22.6096 201.4555 923.0503 64.6008 6.2277 28.8229 3.3206 485.4835 53.1773 79.7388 66.3062 99.2124 153.7923 13.3060 2.0454 109.9408 25.7654 1.9450 102.3668 6.6829 89.3632 188.6152 62.1233 41.3038 332.6032 9.0887 5.7918 35.5708 71.7239 5.8545 40.5291 4.9673 24.6093 26.7337 27.2312 19.2723 21.8708 24.0898 627.4506 73.1928 23.4849 68.4150 32.8704 13.6377 16.5272 41.9681 24.2858 36.4546 28.9654 17.4091 10.4527 10.6992 15.1732 9.4566 3.0336 2.7263 2.0761 2.0766
temp: 298.150 k
press: 1.00000 atm
elementType: 8 8 8 8 7 7 7 7 7 7 7 7 7 7 6 6 6 6 6 6 6 6 6 6 6 6 6 6 1 1 1 1 1 1 1 1 1 1 1 1 1 1 1 1 1 1
symmnumber: 1
zpe: 902474.0 jmol-1
zpe.correction: 0.343734 hartree
zpe.thermalcorrener: 0.369953 hartree
zpe.thermalcorrenthalpy: 0.370897 hartree
zpe.thermalcorrgfe: 0.282151 hartree
zpe.sumelectzpe: -1390.364776 hartree
zpe.sumelectthermal: -1390.338557 hartree
zpe.sumelectthermalent: -1390.337613 hartree
zpe.sumelectthermalfe: -1390.426359 hartree
dipole: -0.4269 -0.6613 5.7154
dipole: 5.7693
quadrupole: -309.9590 -165.8939 -162.0276
quadrupole: 7.4959 -4.5690 0.6215
quadrupole: -97.3322 46.7329 50.5992 7.4959 -4.5690 0.6215
hfenergy: -1390.70851 hartree
pointgroup: C01 [X(C14H18N10O4)]
dipole: 0.1628655 -2.2625268 -0.0808865 debye
polarizability: 625.7134961|25.2520689|172.9244824|-8.9119483|-3.1971167|240.9384407 unknown
InChI: InChI=1S/C14H18N10O4/c1-19-11(15-9-13(19)23(25)26)7-17-21-3-5-22(6-4-21)18-8-12-16-10-14(20(12)2)24(27)28/h7-10H,3-6H2,1-2H3
charge 0 multiplicity 1
46 atoms
O  8.525141 2.179608 0.140493
O  -8.896631 1.645007 -0.013368
O  7.56994 1.467377 -1.817652
O  -7.800154 1.043567 1.907254
N  1.470544 -1.682667 -0.02629
N  -1.220134 -0.754741 -0.038619
N  2.641373 -0.981086 -0.12485
N  -2.508023 -0.30975 0.096874
N  5.339729 0.411163 -0.23843
N  -5.414805 0.546289 0.28021
N  5.186891 0.533345 2.049419
N  -5.309558 0.813153 -1.997921
N  7.571628 1.594986 -0.518449
N  -7.838581 1.234363 0.616579
C  0.640812 -1.829469 1.196025
C  0.685796 -1.771401 -1.26829
C  -0.449436 -0.734409 1.224549
C  -0.44343 -0.707645 -1.302736
C  3.302231 -0.577804 0.955395
C  -3.230656 0.047473 -0.959522
C  4.576064 0.100321 0.888848
C  -4.614125 0.453453 -0.860375
C  6.484708 1.076016 0.250919
C  -6.675036 0.987749 -0.176411
C  4.983507 0.086305 -1.636543
C  -4.983286 0.243778 1.662171
C  6.356843 1.132257 1.655441
C  -6.573354 1.140979 -1.575871
H  1.262738 -1.784477 2.10334
H  0.168389 -2.827824 1.15979
H  0.235076 -2.77876 -1.332728
H  1.368928 -1.624644 -2.118574
H  -1.163402 -0.90589 2.04577
H  0.02225 0.260795 1.375492
H  -0.015161 0.306544 -1.459959
H  -1.110098 -0.936564 -2.151981
H  2.964435 -0.715995 1.993243
H  -2.869898 0.072543 -1.99811
H  4.796607 -0.995461 -1.723381
H  4.058515 0.616422 -1.915622
H  5.811128 0.394396 -2.286983
H  -4.618172 -0.794118 1.712618
H  -4.152894 0.911263 1.942803
H  -5.838501 0.388973 2.333271
H  7.059246 1.574515 2.356225
H  -7.356683 1.46707 -2.254168
