program: Gaussian 09
title: 000096716
version: EM64L-G09RevD.01
frameworkgroup: C1[X(C9H19N3O)]
method: RPBEPBE
basis: SDD
operation: Freq
keyword: #p
keyword: freq=noraman
keyword: PBEPBE/SDD
title: #p freq=noraman PBEPBE/SDD
converged: NO YES NO NO
title: Mulliken charges:
elementType: O N N N C C C C C C C C C H H H H H H H H H H H H H H H H H H H
charge: -0.281631 -0.365129 -0.282414 -0.629120 0.231074 -0.417805 -0.478944 -0.425052 -0.422398 -0.050533 0.191454 -0.715493 -0.678830 0.224861 0.220012 0.165258 0.233278 0.201475 0.206694 0.204321 0.197537 0.242058 0.262483 0.242273 0.215043 0.189147 0.252351 0.222341 0.200481 0.197103 0.326866 0.321240
chargesum: 0.00000
title: Mulliken charges with hydrogens summed into heavy atoms:
elementType: O N N N C C C C C C C C C
charge: -0.281631 -0.123072 -0.019931 0.018986 0.231074 0.027068 -0.080408 -0.016883 -0.020540 0.191740 0.191454 -0.058953 -0.058905
polarizability: 1.26221396e+02 9.12385412e-01 1.23774905e+02 3.13356839e+00 -5.50422206e+00 1.09340623e+02
1716.lowfreq: -16.3984 -5.9079 -0.0003 -0.0002 0.0003 15.2920 49.1175 51.4476 79.2226
frequency: 48.8171 51.0728 79.1926 122.0773 130.1821 183.3002 199.2228 203.2634 239.6473 254.1986 282.0594 318.8683 341.7928 365.5274 388.7466 402.3879 444.6244 455.0486 495.2302 506.1331 515.6260 547.9968 591.5788 600.8315 690.6857 704.2054 757.2521 806.4069 837.8832 868.5107 905.5984 911.7559 928.8588 933.7660 940.0612 1012.9984 1024.3061 1044.8794 1055.4013 1077.4304 1109.8313 1128.7921 1134.1411 1151.0618 1169.7787 1173.8595 1191.5523 1238.9073 1267.4734 1289.1394 1302.4628 1316.6785 1318.1430 1323.6205 1343.3791 1349.1583 1371.5243 1385.6680 1388.9279 1434.3925 1443.0913 1451.9434 1457.2806 1459.1924 1459.7223 1464.3095 1469.1632 1479.0292 1485.1661 1570.2126 1619.8775 2892.3468 2898.1659 2948.7215 2965.5958 2972.0359 3009.9827 3024.4399 3031.8682 3035.6054 3043.0335 3056.9678 3073.0062 3078.4236 3082.2701 3089.3629 3433.8918 3448.8216 3512.6009 3668.4676
redmass: 4.3297 2.6628 3.8595 3.4605 3.3833 2.8037 2.2237 1.3035 1.3566 2.2671 1.7985 3.2015 2.6651 2.4735 1.9365 2.2345 2.8050 2.5995 1.5153 1.7332 1.8697 1.8732 1.3942 2.2869 1.9036 3.0830 3.3790 1.5301 2.2094 2.9362 2.2027 1.3181 1.3849 2.2054 2.3623 1.9248 1.9817 2.2079 1.8649 2.0287 2.4353 2.3117 2.4515 2.7512 2.0142 1.8535 1.1541 1.6923 1.3891 1.3797 1.4040 1.2666 3.1922 1.3978 1.4239 1.3932 1.2215 1.3732 1.2391 1.1521 1.2893 1.1004 1.0863 1.0791 1.0534 1.0885 1.1002 1.0696 1.0711 1.9869 2.1829 1.0697 1.0684 1.0647 1.0374 1.0359 1.0647 1.0902 1.0854 1.0897 1.0957 1.0982 1.0976 1.0991 1.0994 1.0990 1.0742 1.0751 1.0443 1.1036
irintensity: 7.7246 0.4964 3.9952 0.8352 2.3960 1.9322 6.3496 1.7710 1.0150 0.3296 4.6507 3.5617 0.5637 1.3596 5.9253 8.9481 3.6682 7.2527 119.0546 24.5132 33.3434 74.1284 150.0243 27.6912 51.8934 15.7803 22.3870 1.9143 4.1200 4.1904 4.0461 2.2547 0.7825 2.3529 2.6526 0.9881 1.2192 4.4864 12.0311 13.7016 16.5147 15.1441 34.7669 10.1416 54.9431 24.8751 7.4723 5.0192 2.7808 16.5816 1.1662 9.8555 92.0914 44.7495 7.2781 2.3005 22.0339 3.4123 22.0042 13.5979 1.5407 20.1239 7.5463 7.1729 1.5462 2.5177 10.5036 1.9099 16.5558 85.3350 244.0885 55.9635 108.5013 57.3767 28.8406 41.3640 11.1725 57.3500 3.6805 39.8384 45.6992 3.8530 64.4328 40.0127 29.8314 38.1604 1.4523 1.9696 20.0787 25.3059
temp: 298.150 k
press: 1.00000 atm
elementType: 8 7 7 7 6 6 6 6 6 6 6 6 6 1 1 1 1 1 1 1 1 1 1 1 1 1 1 1 1 1 1 1
symmnumber: 1
zpe: 737381.2 jmol-1
zpe.correction: 0.280854 hartree
zpe.thermalcorrener: 0.295335 hartree
zpe.thermalcorrenthalpy: 0.296279 hartree
zpe.thermalcorrgfe: 0.240319 hartree
zpe.sumelectzpe: -592.771718 hartree
zpe.sumelectthermal: -592.757237 hartree
zpe.sumelectthermalent: -592.756292 hartree
zpe.sumelectthermalfe: -592.812253 hartree
dipole: -0.9874 0.2910 -3.7201
dipole: 3.8599
quadrupole: -81.8896 -74.0592 -81.0495
quadrupole: 1.6727 -2.1480 -8.8996
quadrupole: -2.8902 4.9402 -2.0500 1.6727 -2.1480 -8.8996
hfenergy: -593.0525715 hartree
pointgroup: C01 [X(C9H19N3O1)]
dipole: 0.2808007 -0.1217754 -1.4874435 debye
polarizability: 125.733937|1.2622218|123.7463699|-4.2101988|5.4788152|109.8566173 unknown
InChI: InChI=1S/C9H19N3O/c1-7(2)12-9(8(10)13)3-5-11-6-4-9/h7,11-12H,3-6,10H2,1-2H3
charge 0 multiplicity 1
32 atoms
O  -1.341292 -1.6249 1.552799
N  -0.626819 0.608389 -0.586186
N  2.952532 0.623781 -0.083422
N  -0.863797 -2.70891 -0.431104
C  0.217067 -0.468918 0.00998
C  0.972176 0.046227 1.27023
C  1.268881 -0.883733 -1.062267
C  1.995797 1.143132 0.923454
C  2.28124 0.247755 -1.345498
C  -1.785559 1.189308 0.154795
C  -0.698854 -1.655973 0.456996
C  -3.136484 0.626863 -0.355914
C  -1.752949 2.731977 0.049714
H  1.503903 -0.810519 1.725137
H  0.247023 0.407413 2.019564
H  0.76854 -1.15438 -2.017802
H  1.827401 -1.765566 -0.695704
H  1.44937 2.046603 0.56139
H  2.557066 1.421125 1.834673
H  3.0427 -0.114559 -2.061531
H  1.739081 1.102453 -1.816419
H  -0.864448 0.406175 -1.566963
H  3.741368 1.264538 -0.239779
H  -1.679524 0.89652 1.214698
H  -3.984489 1.070744 0.197621
H  -3.275639 0.865817 -1.429779
H  -3.181341 -0.468197 -0.225911
H  -0.795769 3.124379 0.435886
H  -2.581228 3.187866 0.624686
H  -1.849844 3.052186 -1.005392
H  -1.509704 -3.455737 -0.174035
H  -0.326708 -2.790056 -1.291516
