program: Gaussian 09
title: 000096245
version: EM64L-G09RevD.01
frameworkgroup: C1[X(C16H13ClO4)]
method: RPBEPBE
basis: SDD
operation: Freq
keyword: #p
keyword: freq=noraman
keyword: PBEPBE/SDD
title: #p freq=noraman PBEPBE/SDD
converged: YES YES NO NO
title: Mulliken charges:
elementType: Cl O O O O C C C C C C C C C C C C C C C C H H H H H H H H H H H H H
charge: -0.048814 -0.296217 -0.232342 -0.411884 -0.243542 -0.520006 0.296284 0.123432 -0.492733 -0.317721 -0.340738 0.333718 -0.401461 -0.361612 0.348719 0.182935 -0.343227 -0.367082 -0.182252 -0.175012 -0.121527 0.244241 0.271404 0.262084 0.287264 0.252985 0.280206 0.262267 0.271434 0.274899 0.265637 0.260354 0.260923 0.377383
chargesum: 0.00000
title: Mulliken charges with hydrogens summed into heavy atoms:
elementType: Cl O O O O C C C C C C C C C C C C C C C C
charge: -0.048814 -0.296217 -0.232342 -0.034501 -0.243542 -0.004361 0.296284 0.123432 0.056615 -0.064735 -0.060532 0.333718 -0.139194 -0.090178 0.348719 0.182935 -0.068328 -0.101445 0.078102 0.085911 -0.121527
polarizability: 3.54008864e+02 -2.20946568e+00 1.62637959e+02 -4.64425269e+00 -8.50461728e-01 1.15972413e+02
1716.lowfreq: -0.0004 0.0018 0.0023 1.6723 3.8272 9.8051 13.7874 21.0192 27.2156
frequency: 13.7649 20.9542 27.1883 40.8521 48.5970 57.0047 74.4910 98.2786 118.6965 128.4482 178.4894 202.6710 240.9381 266.8210 288.0616 291.5635 330.3290 383.7619 397.9409 411.9940 416.2401 454.2530 480.7722 489.3951 500.7022 519.8595 559.3044 588.8486 601.8336 616.9627 632.2060 649.7300 650.6942 698.3378 724.3681 738.3208 779.1766 800.3494 815.0607 828.4606 836.2411 852.9971 859.3343 897.5520 943.5285 957.5803 966.0004 980.1306 994.4889 995.4905 1005.1645 1013.0415 1056.3304 1068.6475 1101.8279 1102.3286 1117.4566 1147.6927 1152.5719 1170.2251 1186.6976 1216.5870 1227.9182 1251.3150 1257.4126 1284.4940 1301.3405 1323.8836 1362.4173 1374.0129 1379.8570 1397.8353 1424.7327 1440.1689 1446.7094 1466.0787 1493.0424 1561.7140 1585.0753 1591.1688 1597.1250 1619.7378 1661.9396 2983.1231 3005.7620 3035.2717 3075.1152 3150.4187 3150.8277 3157.7583 3164.1592 3169.2519 3175.2233 3177.3796 3183.3014 3512.8484
redmass: 9.7072 6.4448 8.4706 6.2286 4.5910 5.7875 4.4197 4.4145 4.2014 4.0496 5.7054 8.2520 6.9293 7.9617 7.0789 6.3670 6.9969 5.2507 9.3534 2.9609 3.0146 4.0685 3.2354 2.6545 3.5539 2.8712 2.5596 3.8113 5.0500 7.1312 6.6820 4.9705 1.5156 3.9836 4.2876 4.1710 5.4605 1.7798 1.2613 1.5977 1.3101 3.6565 1.8716 3.7082 1.3260 1.3508 1.3694 5.5394 1.3994 3.9070 2.5748 2.1506 2.5207 2.6547 2.2328 1.3461 1.3329 1.2240 2.0612 1.1979 1.5960 1.6263 3.5850 1.8878 1.2920 1.2532 1.3138 2.0069 5.3625 2.4234 4.6321 3.6271 4.2964 1.0867 1.1175 2.3581 2.5117 7.7776 7.1128 7.3783 7.2126 6.8453 8.1120 1.0618 1.0651 1.0964 1.0953 1.0882 1.0885 1.0890 1.0890 1.0962 1.0969 1.0971 1.0980 1.0639
irintensity: 0.1989 2.0677 0.7213 0.2742 1.7165 0.7282 1.8635 1.7752 1.0076 0.1406 11.4335 6.1093 0.5324 1.4820 1.6660 1.7493 10.2650 1.7020 0.3759 1.1750 0.5325 28.8031 29.0914 19.5066 15.4713 97.0033 13.3507 32.0691 0.3364 12.5654 8.9180 11.1781 116.5414 6.5027 0.9268 3.8204 5.1318 56.1809 1.8420 75.2553 5.3100 38.5726 27.6197 2.6719 0.2687 0.3373 1.1943 20.7588 5.6905 67.4772 13.7769 38.4466 341.6464 62.2686 35.2154 18.9529 11.5122 0.7528 11.1429 132.8259 123.7938 43.9500 498.7527 166.0080 34.8211 0.3794 3.0635 292.6203 32.0590 19.5160 3.8761 3.1724 8.2115 16.1566 45.5050 304.4736 39.6046 157.8955 108.7491 74.6195 39.6291 110.7377 184.9764 27.3687 29.7406 5.8903 6.9513 0.2041 10.0583 5.7359 2.5563 7.1025 3.5971 1.6437 0.8762 26.0769
temp: 298.150 k
press: 1.00000 atm
elementType: 17 8 8 8 8 6 6 6 6 6 6 6 6 6 6 6 6 6 6 6 6 1 1 1 1 1 1 1 1 1 1 1 1 1
symmnumber: 1
zpe: 656606.6 jmol-1
zpe.correction: 0.250088 hartree
zpe.thermalcorrener: 0.269430 hartree
zpe.thermalcorrenthalpy: 0.270374 hartree
zpe.thermalcorrgfe: 0.197688 hartree
zpe.sumelectzpe: -1376.970389 hartree
zpe.sumelectthermal: -1376.951047 hartree
zpe.sumelectthermalent: -1376.950103 hartree
zpe.sumelectthermalfe: -1377.022789 hartree
dipole: 0.2006 1.8018 -0.4638
dipole: 1.8713
quadrupole: -129.7786 -131.6069 -129.6552
quadrupole: -2.3789 -1.7688 -7.1493
quadrupole: 0.5683 -1.2600 0.6917 -2.3789 -1.7688 -7.1493
hfenergy: -1377.220477 hartree
pointgroup: C01 [X(C16H13Cl1O4)]
dipole: -0.0989185 -0.716805 -0.1358766 debye
polarizability: 353.7429416|-7.2628934|162.8067979|4.9315473|-2.338854|116.0694962 unknown
InChI: InChI=1S/C16H13ClO4/c17-12-3-7-14(8-4-12)21-13-5-1-11(2-6-13)15(18)9-10-16(19)20/h1-8,19H,9-10H2
charge 0 multiplicity 1
34 atoms
Cl -7.600627 1.465714 0.368417
O  -2.336592 -1.446551 -0.035749
O  3.113803 1.952642 -0.750027
O  7.867827 0.330485 -0.040568
O  6.541449 -0.77913 1.505871
C  4.146334 -0.119869 0.011157
C  1.572609 0.169782 -0.263921
C  2.946514 0.75393 -0.368793
C  5.486828 0.569052 -0.285416
C  1.326765 -1.143846 0.225076
C  0.464713 0.9630 -0.672395
C  -1.068154 -0.833297 -0.094224
C  0.01628 -1.645456 0.312324
C  -0.850544 0.475408 -0.595317
C  -3.528463 -0.677693 0.039184
C  6.628151 -0.045163 0.495007
C  -3.664259 0.422997 0.916657
C  -4.620758 -1.142547 -0.723352
C  -4.910312 1.079596 1.014692
C  -5.869238 -0.490506 -0.622178
C  -5.993449 0.615371 0.241724
H  4.083932 -1.091581 -0.514889
H  4.090049 -0.363356 1.091674
H  5.731691 0.554042 -1.361278
H  5.417657 1.643171 -0.022627
H  2.156157 -1.779651 0.550431
H  0.667551 1.967862 -1.057295
H  -0.189662 -2.651525 0.688405
H  -1.690984 1.089787 -0.931129
H  -2.819328 0.758478 1.525425
H  -4.487009 -2.005704 -1.381179
H  -5.034914 1.931181 1.689314
H  -6.725512 -0.837058 -1.207181
H  8.596497 -0.056862 0.516961
