program: Gaussian 09
title: 000095743
version: EM64L-G09RevD.01
frameworkgroup: C1[X(C9H9ClO)]
method: RPBEPBE
basis: SDD
operation: Freq
keyword: #p
keyword: freq=noraman
keyword: PBEPBE/SDD
title: #p freq=noraman PBEPBE/SDD
converged: YES YES NO NO
title: Mulliken charges:
elementType: Cl O C C C C C C C C C H H H H H H H H H
charge: -0.050616 -0.224893 0.379381 -0.472440 0.154190 -0.291563 -0.325667 -0.681879 -0.223211 -0.234697 -0.216325 0.241824 0.247655 0.285530 0.224009 0.212219 0.235999 0.259612 0.240053 0.240819
chargesum: 0.00000
title: Mulliken charges with hydrogens summed into heavy atoms:
elementType: Cl O C C C C C C C C C
charge: -0.050616 -0.224893 0.379381 0.017039 0.154190 -0.291563 -0.040136 -0.009653 0.036401 0.005356 0.024494
polarizability: 1.44423770e+02 -4.63135644e+00 1.22993054e+02 3.79260567e+00 5.22071214e-01 5.28343738e+01
1716.lowfreq: -13.7989 -7.0511 -4.8881 -0.0028 0.0015 0.0021 15.4873 95.2323 121.1688
frequency: 15.4297 95.2306 121.1670 162.7100 183.4474 212.1900 237.7638 301.2929 327.1369 410.3716 421.3537 476.8171 504.3318 566.4359 623.6775 671.0294 714.6476 749.8584 766.8847 810.8188 881.7351 946.7425 971.5355 1003.3434 1008.9629 1022.2909 1050.6894 1068.7192 1094.2717 1118.1573 1172.7835 1200.5879 1241.9177 1258.0245 1340.3400 1368.5415 1394.4191 1414.1807 1422.5673 1447.7459 1468.3626 1478.1580 1558.9203 1579.4288 1604.0677 2985.4726 2997.6516 3032.1926 3092.5330 3103.9668 3140.2520 3151.9378 3164.6389 3176.8715
redmass: 5.6723 2.2488 2.6419 4.2911 1.6853 2.5265 5.2171 5.3614 4.9532 4.3414 5.7012 4.0593 5.1315 2.3968 5.7488 5.1259 3.3846 4.4904 1.2116 1.4869 1.3692 4.2786 1.3639 1.3534 3.7207 2.2404 2.0044 1.6731 2.5566 1.7699 1.0609 2.3485 1.1874 1.4819 1.8611 7.6514 1.2114 1.8768 1.2249 2.3420 1.0403 1.0527 6.2898 7.3510 7.0550 1.0614 1.0367 1.0965 1.1003 1.0997 1.0860 1.0902 1.0951 1.1004
irintensity: 4.5244 1.0376 0.2549 1.8413 0.1409 1.4288 0.6798 2.8428 8.8598 5.8340 8.1777 7.6103 1.0390 1.2896 5.6496 14.0773 0.4208 4.9713 101.8607 1.9359 0.0967 34.6305 2.5245 1.3542 47.7938 12.2236 1.4821 1.7448 7.0780 5.1353 4.7361 111.9597 4.6607 32.2478 54.3020 2.9046 24.1320 30.6749 44.4866 25.4117 12.6840 13.7345 17.2848 111.6047 32.1839 20.2016 27.2186 5.2638 28.9098 27.3971 3.6264 1.4377 9.3861 16.8863
temp: 298.150 k
press: 1.00000 atm
elementType: 17 8 6 6 6 6 6 6 6 6 6 1 1 1 1 1 1 1 1 1
symmnumber: 1
zpe: 402750.4 jmol-1
zpe.correction: 0.153400 hartree
zpe.thermalcorrener: 0.163995 hartree
zpe.thermalcorrenthalpy: 0.164940 hartree
zpe.thermalcorrgfe: 0.115580 hartree
zpe.sumelectzpe: -882.836155 hartree
zpe.sumelectthermal: -882.825559 hartree
zpe.sumelectthermalent: -882.824615 hartree
zpe.sumelectthermalfe: -882.873975 hartree
dipole: 2.3903 0.9459 0.8223
dipole: 2.6989
quadrupole: -62.2414 -74.3337 -73.9378
quadrupole: -6.5213 -0.5609 -1.6543
quadrupole: 7.9296 -4.1627 -3.7668 -6.5213 -0.5609 -1.6543
hfenergy: -882.9895548 hartree
pointgroup: C01 [X(C9H9Cl1O1)]
dipole: -0.9669581 0.0374928 -0.4371358 debye
dipolederiv: -0.2374324 -0.1808029 0.1725621 -0.139292 -0.4013302 0.3169197 0.1221285 0.3106352 -0.3471262 -0.8343775 0.0913994 -0.1027311 0.1833719 -0.4185652 0.2193657 -0.2255927 0.1942692 -0.6509446 -0.8108537 0.006165 0.001991 -0.0346324 -0.1389285 0.1618711 0.051414 0.1520844 -0.1676789 -0.1497918 -0.049865 0.0988604 -0.1688145 -0.0212064 0.2082971 0.1966748 0.1564869 -0.1386802 1.5978613 -0.099787 0.0510703 -0.0510059 0.3026801 -0.3454198 0.0151001 -0.2920993 0.6803075 0.4442598 0.345311 -0.3169717 0.1209556 0.5053535 -0.5220325 -0.0341163 -0.5170858 0.4240443 0.055516 -0.0407128 0.0536797 0.0605971 -0.0547868 -0.039646 -0.1179455 -0.0500548 -0.0565886 -0.0443687 0.0383442 -0.0240625 0.0416411 0.0817706 -0.0176517 0.004399 -0.0043233 0.070438 -0.2607056 -0.1752898 0.1673252 -0.1516672 -0.1597958 0.0409617 0.1451879 0.0403027 -0.142679 -0.1258304 0.1414724 -0.1382055 0.0895576 -0.0595385 -0.0934602 -0.0905364 -0.0959417 -0.067389 0.14386 -0.018889 0.0286649 0.0385955 0.0105681 -0.1368839 -0.0273905 -0.1329055 0.0003904 -0.0191286 -0.0382301 -0.0667486 -0.0246596 0.0929771 -0.0526175 -0.0894712 -0.033847 -0.0381413 0.0632714 0.0395171 0.0361342 0.0591617 -0.0569671 -0.0237581 0.0310515 -0.0227659 0.0920514 0.1268765 0.0402794 -0.0353955 0.0233278 0.0903288 0.0560981 0.000714 0.0683456 0.0891412 0.0635734 -0.0129357 0.0023827 0.0549822 -0.1430101 -0.0390559 -0.0210693 -0.0137987 0.0947165 -0.0584144 -0.0383404 0.0933628 -0.078059 0.0522098 0.0836581 0.1492185 0.0734323 -0.0280071 0.0660914 -0.0124542 -0.0421169 0.0005934 0.0740504 -0.0557744 -0.1193444 -0.0633874 -0.0760646 0.0593956 0.0310662 -0.0345037 0.0483737 0.0722304 0.0915282 -0.0530658 0.0863205 0.0789906 0.025122 -0.0578201 0.0548482 -0.0687179 0.0507646 0.1109922 0.0654736 0.1059119 0.060428 -0.1049245 -0.0084278 -0.000146 -0.0043091 0.1211953 0.0366081 -0.00283 0.0384205 0.1227917 unknown
polarizability: 144.2265187|3.4285287|86.6015687|-4.1341524|-35.312139|89.4231101 unknown
InChI: InChI=1S/C9H9ClO/c1-2-9(11)7-5-3-4-6-8(7)10/h3-6H,2H2,1H3
charge 0 multiplicity 1
20 atoms
Cl -0.119174 1.675908 -1.912722
O  1.84835 -1.131215 1.223858
C  -0.122709 -0.39985 0.075811
C  2.340865 0.043988 -0.836774
C  1.389361 -0.516179 0.216992
C  -0.878257 0.443868 -0.781549
C  -0.873894 -1.266924 0.927527
C  3.792282 -0.430103 -0.644423
C  -2.289249 0.428633 -0.804284
C  -2.278044 -1.304191 0.91664
C  -2.993369 -0.452724 0.04225
H  1.962475 -0.214919 -1.844602
H  2.288093 1.150467 -0.793758
H  -0.29295 -1.905949 1.600892
H  3.867902 -1.528418 -0.725595
H  4.444891 0.02433 -1.410998
H  4.169976 -0.151571 0.353461
H  -2.825145 1.104389 -1.47678
H  -2.8128 -1.989257 1.582171
H  -4.088104 -0.465584 0.018286
