program: Gaussian 09
title: 000095865
version: EM64L-G09RevD.01
frameworkgroup: C1[X(C17H15NO2)]
method: RPBEPBE
basis: SDD
operation: Freq
keyword: #p
keyword: freq=noraman
keyword: PBEPBE/SDD
title: #p freq=noraman PBEPBE/SDD
converged: YES YES NO NO
title: Mulliken charges:
elementType: O O N C C C C C C C C C C C C C C C C C H H H H H H H H H H H H H H H
charge: -0.251866 -0.245497 -0.440240 0.317576 0.489813 -0.322396 -0.359948 -0.474896 -0.359012 0.090109 0.469154 -0.309868 -0.268654 -0.375056 -0.385265 0.216235 -0.238027 -0.238782 -0.234836 -0.799691 0.218333 0.281744 0.218618 0.310770 0.204400 0.311835 0.269362 0.224910 0.239458 0.228441 0.231833 0.232877 0.237243 0.271933 0.239392
chargesum: 0.00000
title: Mulliken charges with hydrogens summed into heavy atoms:
elementType: O O N C C C C C C C C C C C C C C C C C
charge: -0.251866 -0.245497 -0.128405 0.317576 0.489813 -0.104063 -0.078204 -0.256278 -0.048242 0.090109 0.469154 -0.105468 0.000708 -0.150146 -0.145807 0.216235 -0.009586 -0.006949 -0.001958 -0.051124
polarizability: 4.61302384e+02 -2.51373540e+00 1.99882694e+02 -3.48008923e-01 -6.24762272e-02 8.08437988e+01
1716.lowfreq: -79.8744 -3.8043 -2.2440 -0.0004 0.0005 0.0007 3.2709 13.0028 21.4112
frequency: -79.8631 12.5949 21.3469 42.8827 59.1367 71.8125 92.4526 112.2221 117.8795 162.9051 176.0630 209.2690 274.2896 277.1028 315.5480 321.0301 361.1067 402.7596 409.0745 437.6663 487.3272 512.0134 513.1438 551.9743 577.3750 583.0934 615.5654 630.4531 654.0416 671.9261 673.9295 696.3073 751.7918 778.7890 780.6475 822.9799 826.5204 847.7114 878.0671 880.2644 898.9318 926.7880 929.5259 947.2454 980.1562 983.8844 987.9534 997.2279 1000.6269 1017.7127 1022.4099 1022.8940 1032.0749 1034.5883 1083.4424 1127.1842 1174.0554 1188.1015 1193.3220 1216.2446 1221.1844 1227.0504 1267.6160 1296.1931 1306.3403 1331.4438 1335.8120 1368.3871 1378.2391 1386.9408 1421.5343 1440.0893 1447.3402 1468.0799 1485.0049 1489.6612 1507.1490 1518.9750 1580.4335 1585.3356 1610.0708 1617.2139 1638.3104 1641.0145 2988.4010 3073.2122 3095.9688 3111.9130 3125.1159 3128.6782 3137.9010 3140.5618 3145.3130 3152.3498 3156.8230 3163.1260 3167.3368 3198.7301 3517.7943
redmass: 1.0420 4.4131 4.6206 5.4365 4.5110 5.1189 6.0337 3.2462 5.6478 3.6853 6.1026 5.1343 3.0824 6.0055 4.9571 7.5138 4.1769 2.7579 2.9230 5.1350 2.8538 3.8760 3.2166 5.9013 5.2209 2.9730 6.4329 6.9653 1.1814 3.3682 6.2434 1.6851 2.4480 6.0025 2.3182 1.4909 4.7364 1.2840 1.6514 4.2995 1.6492 1.4380 6.5990 1.4261 1.3865 1.7031 6.0552 1.3201 3.4590 1.2366 2.2654 1.3767 1.6605 2.4971 1.6088 1.3596 1.0674 1.1714 1.1463 3.0061 1.9735 1.9109 1.9141 1.5037 2.0368 1.8230 1.3619 3.4419 1.2419 6.8694 4.2120 2.3056 1.1550 1.0467 2.3096 2.1121 3.1825 5.2025 5.6423 5.2762 5.9300 5.6298 5.6842 5.4345 1.0385 1.0983 1.0892 1.0893 1.0855 1.0876 1.0979 1.0917 1.0915 1.0962 1.0904 1.0916 1.1015 1.0950 1.0763
irintensity: 0.0271 1.7437 0.1272 0.5132 0.0028 6.7831 1.2687 0.4528 1.3632 0.1804 3.7105 2.7305 1.5219 8.4805 0.7189 2.5002 10.5920 0.0332 0.0193 2.9120 2.1360 17.2284 26.0104 14.0704 29.1824 0.5135 0.2007 4.7181 54.7595 24.5214 19.3210 30.8042 15.0558 9.5505 77.8321 25.8988 0.1223 0.6752 46.5010 2.9718 14.7352 0.0191 11.1374 2.7155 0.1907 52.9399 5.2089 3.8128 33.6679 39.2360 3.3035 0.2160 8.5627 54.3735 7.7174 20.9325 5.2751 187.1640 71.6000 111.0911 12.8414 228.9879 43.6772 1.8190 265.0022 9.5503 93.8223 392.1995 78.3001 60.3382 52.2386 44.9158 58.0555 20.4391 57.9995 240.6761 98.9962 159.6083 51.0421 149.1364 14.3835 357.1406 168.4600 123.4006 7.7782 14.4971 0.6735 26.1168 5.1405 0.6568 7.7266 10.4638 0.0563 36.7514 6.6225 18.8009 37.8569 3.1819 12.9749
temp: 298.150 k
press: 1.00000 atm
elementType: 8 8 7 6 6 6 6 6 6 6 6 6 6 6 6 6 6 6 6 6 1 1 1 1 1 1 1 1 1 1 1 1 1 1 1
symmnumber: 1
zpe: 719243.2 jmol-1
zpe.correction: 0.273945 hartree
zpe.thermalcorrener: 0.291321 hartree
zpe.thermalcorrenthalpy: 0.292266 hartree
zpe.thermalcorrgfe: 0.225346 hartree
zpe.sumelectzpe: -860.621406 hartree
zpe.sumelectthermal: -860.604030 hartree
zpe.sumelectthermalent: -860.603085 hartree
zpe.sumelectthermalfe: -860.670006 hartree
dipole: 0.5341 -7.2500 -0.0379
dipole: 7.2698
quadrupole: -87.9374 -110.9122 -123.4439
quadrupole: 20.4846 0.1729 -0.0370
quadrupole: 19.4938 -3.4810 -16.0127 20.4846 0.1729 -0.0370
hfenergy: -860.8953511 hartree
pointgroup: C01 [X(C17H15N1O2)]
dipole: -0.2268677 2.8495459 0.0955364 debye
polarizability: 461.2971553|-1.0938943|199.6735772|3.1114674|4.7332326|81.0581439 unknown
InChI: InChI=1S/C17H15NO2/c1-13(19)18-16-10-8-15(9-11-16)17(20)12-7-14-5-3-2-4-6-14/h2-12,18H,1H3
charge 0 multiplicity 1
35 atoms
O  -0.57565 -2.424758 -0.092232
O  6.28585 -0.858048 0.038325
N  4.89455 1.03646 0.078152
C  0.92287 -0.54242 -0.007356
C  3.596858 0.462485 0.049074
C  1.172582 0.857333 0.035469
C  2.043645 -1.417992 -0.021038
C  2.486834 1.352543 0.062944
C  3.363984 -0.941791 0.006599
C  -0.448239 -1.153764 -0.040717
C  -4.189097 -0.099892 -0.026463
C  -1.645161 -0.270592 -0.012541
C  -2.904588 -0.809674 -0.048058
C  -4.300744 1.320682 0.046697
C  -5.389601 -0.867004 -0.080381
C  6.143792 0.396335 0.072171
C  -5.562968 1.943538 0.064432
C  -6.654354 -0.243847 -0.063044
C  -6.746471 1.165338 0.009579
C  7.325008 1.36605 0.112856
H  0.348507 1.576754 0.046163
H  1.843057 -2.493919 -0.054611
H  2.65721 2.436646 0.095013
H  4.21445 -1.624833 -0.004137
H  -1.502291 0.813356 0.037887
H  4.919241 2.059186 0.106678
H  -2.948711 -1.908221 -0.09878
H  -3.396561 1.937844 0.090477
H  -5.318874 -1.960101 -0.136118
H  -5.631574 3.035641 0.121078
H  -7.564256 -0.852242 -0.105482
H  -7.726868 1.65412 0.023651
H  7.309028 2.05826 -0.749493
H  8.256654 0.783726 0.081124
H  7.316389 1.970098 1.039286
