program: Gaussian 09
title: 000095633
version: EM64L-G09RevD.01
frameworkgroup: C1[X(C11H14O2)]
method: RPBEPBE
basis: SDD
operation: Freq
keyword: #pfreq=noraman
keyword: PBEPBE/SDD
title: #p freq=noraman PBEPBE/SDD
converged: YES YES NO NO
title: Mulliken charges:
elementType: O O C C C C C C C C C C C H H H H H H H H H H H H H H
charge: -0.285510 -0.272677 0.023452 -0.060482 -0.309182 -0.565579 -0.692042 0.473710 -0.377052 -0.446793 -0.226954 -0.218158 -0.246627 0.220404 0.237070 0.214914 0.211737 0.232745 0.223310 0.234149 0.240129 0.215893 0.270428 0.230642 0.222630 0.223654 0.226187
chargesum: 0.00000
title: Mulliken charges with hydrogens summed into heavy atoms:
elementType: O O C C C C C C C C C C C
charge: -0.285510 -0.272677 0.243856 0.176588 0.117468 -0.109523 -0.001870 0.473710 -0.106623 -0.216151 -0.004324 0.005496 -0.020440
polarizability: 1.58213086e+02 3.24943142e+00 1.17770242e+02 1.31737661e+01 -7.88934974e+00 8.00975043e+01
1716.lowfreq: -7.2251 -1.8187 -0.0001 0.0002 0.0003 7.0188 22.9451 30.5471 65.4479
frequency: 22.3939 29.6079 65.4381 90.9625 118.9359 216.7672 227.3484 264.9710 288.1807 339.5735 389.7391 405.1220 453.7074 514.9501 575.5877 617.7564 670.7552 705.0287 706.3991 752.0806 771.1751 800.5241 826.0713 857.4500 877.7377 896.2544 922.9414 928.9656 954.5082 979.2521 990.3036 994.1884 1003.8396 1028.9608 1044.9952 1083.3268 1093.1416 1103.2315 1128.9733 1171.0446 1188.6776 1190.3432 1197.2608 1213.0908 1268.3289 1275.4562 1302.7671 1329.1012 1333.0185 1342.1891 1371.0445 1382.0458 1388.2540 1438.5361 1449.0857 1465.1149 1472.7281 1485.4281 1488.2752 1592.2377 1615.2772 2968.6131 2986.8894 2998.9812 3003.1545 3053.5285 3068.4162 3069.2664 3083.1428 3099.7668 3113.8770 3123.4420 3136.9843 3150.9019 3162.7995
redmass: 3.8620 3.1284 4.2435 4.7866 3.5027 1.4245 1.9773 3.7321 4.0073 2.3733 2.4145 2.8280 2.7781 3.0637 5.3232 6.1688 6.9440 2.8676 2.1071 1.7188 3.5411 4.4554 2.9787 1.2457 3.5484 2.9482 1.5178 1.5317 3.5129 1.3976 4.2987 1.6104 2.2323 2.2241 1.9020 1.5890 1.9825 1.9405 1.7894 1.0569 1.4336 1.1339 1.2767 2.2181 1.2390 1.3767 1.4032 1.2662 1.2971 1.3526 1.4562 6.6641 1.2261 1.7425 1.2540 1.0492 1.0486 2.3020 1.0887 6.0464 6.0526 1.0848 1.0370 1.0595 1.0614 1.0897 1.1022 1.1049 1.0979 1.1002 1.0865 1.0869 1.0927 1.0954 1.1010
irintensity: 1.1640 3.8844 0.4253 1.1925 0.4929 2.0073 2.6643 1.9436 4.7347 0.4060 1.9385 0.1774 4.6200 35.2097 5.7150 0.8577 3.2728 11.9693 38.8966 52.0370 23.0491 3.9698 7.8472 0.3593 21.3344 11.7893 5.5624 3.4828 68.4736 0.2995 2.7524 16.1228 62.4401 7.8399 26.3715 15.4274 5.1596 100.2729 28.1632 0.3788 10.6769 1.0846 6.3766 0.1841 0.2952 3.5271 3.1341 4.4731 8.3424 2.8499 28.2592 0.4860 31.7953 4.1848 16.9254 12.0983 10.0749 24.3588 1.3690 0.8391 8.8867 48.6459 19.9085 65.8600 23.2891 13.3235 8.0208 39.8667 48.9809 27.5936 7.8564 1.2458 31.5651 25.2838 20.3386
temp: 298.150 k
press: 1.00000 atm
elementType: 8 8 6 6 6 6 6 6 6 6 6 6 6 1 1 1 1 1 1 1 1 1 1 1 1 1 1
symmnumber: 1
zpe: 590478.0 jmol-1
zpe.correction: 0.224901 hartree
zpe.thermalcorrener: 0.237036 hartree
zpe.thermalcorrenthalpy: 0.237980 hartree
zpe.thermalcorrgfe: 0.184454 hartree
zpe.sumelectzpe: -577.017593 hartree
zpe.sumelectthermal: -577.005458 hartree
zpe.sumelectthermalent: -577.004514 hartree
zpe.sumelectthermalfe: -577.058040 hartree
dipole: -1.7434 1.0268 0.2458
dipole: 2.0382
quadrupole: -63.9706 -76.7132 -78.9176
quadrupole: -4.4262 3.2890 -0.6057
quadrupole: 9.2299 -3.5127 -5.7171 -4.4262 3.2890 -0.6057
hfenergy: -577.2424945 hartree
pointgroup: C01 [X(C11H14O2)]
dipole: -0.6772481 0.4252228 0.0594091 debye
polarizability: 157.4770751|2.9756733|116.9448874|15.2648363|-9.55174|81.6588689 unknown
InChI: InChI=1S/C11H14O2/c1-9-8-12-11(13-9)7-10-5-3-2-4-6-10/h2-6,9,11H,7-8H2,1H3
charge 0 multiplicity 1
27 atoms
O  -1.613492 0.696031 -0.612156
O  -2.456873 -1.378269 0.131288
C  -1.261622 -0.495413 0.170063
C  -3.085159 0.867554 -0.456311
C  -3.578066 -0.6021 -0.451576
C  -0.06058 -1.212195 -0.454032
C  -3.440759 1.656651 0.812541
C  1.278838 -0.530231 -0.198757
C  1.508471 0.811048 -0.606368
C  2.329563 -1.2332 0.443878
C  2.758681 1.427262 -0.378403
C  3.582356 -0.618248 0.672754
C  3.801502 0.715709 0.260703
H  -1.077731 -0.219804 1.229864
H  -3.408015 1.410283 -1.360761
H  -4.468149 -0.751858 0.184159
H  -3.779184 -0.967799 -1.475636
H  -0.266665 -1.300199 -1.537764
H  -0.047742 -2.23528 -0.036719
H  -3.174007 1.093587 1.724827
H  -2.902538 2.61972 0.826227
H  -4.526461 1.865299 0.84421
H  0.698653 1.364826 -1.093352
H  2.166053 -2.269811 0.764716
H  2.921065 2.462768 -0.699566
H  4.382827 -1.178495 1.169597
H  4.771538 1.194962 0.435372
