program: Gaussian 09
title: 000100918
version: EM64L-G09RevD.01
frameworkgroup: C1[X(C16H18N6O5S)]
method: RPBEPBE
basis: SDD
operation: Freq
keyword: #p
keyword: freq=noraman
keyword: PBEPBE/SDD
title: #p freq=noraman PBEPBE/SDD
converged: YES YES NO NO
title: Mulliken charges:
elementType: S O O O O O N N N N N N C C C C C C C C C C C C C C C C H H H H H H H H H H H H H H H H H H
charge: 0.384032 -0.270307 -0.200684 -0.232770 -0.211155 -0.220647 -0.145471 -0.454035 -0.101926 -0.045360 0.033473 0.082612 0.528018 -0.398639 -0.403739 -0.490206 -0.347213 0.317675 -0.653928 -0.649841 -0.044063 -0.290990 0.215540 -0.360321 0.415017 -0.790553 -0.284955 -0.092903 0.235660 0.236948 0.253760 0.229475 0.325233 0.240982 0.228627 0.224395 0.239841 0.231636 0.212910 0.254085 0.279903 0.412761 0.270547 0.251393 0.251842 0.333340
chargesum: 0.00000
title: Mulliken charges with hydrogens summed into heavy atoms:
elementType: S O O O O O N N N N N N C C C C C C C C C C C C C C C C
charge: 0.384032 -0.270307 -0.200684 -0.232770 -0.211155 -0.220647 -0.145471 -0.041273 -0.101926 -0.045360 0.033473 0.082612 0.528018 0.073969 0.079496 -0.164973 -0.106231 0.317675 0.038934 0.048791 -0.044063 -0.011087 0.215540 -0.360321 0.415017 -0.016771 0.048385 -0.092903
polarizability: 8.20852019e+02 1.30650074e+01 3.23909483e+02 6.49614314e+00 1.06568239e+01 1.26601845e+02
1716.lowfreq: -4.9713 -3.0109 -1.4345 0.0003 0.0007 0.0017 17.0341 23.3234 35.8144
frequency: 17.0049 23.3105 35.7965 39.4193 54.8378 64.0281 66.2454 74.8538 78.4856 87.7242 96.2771 111.7900 116.2200 125.6496 136.8610 141.6221 143.4878 168.3927 179.0483 200.4486 213.6975 238.8958 243.4236 270.5711 273.1394 306.2102 309.3919 323.1759 328.8826 352.0478 355.3262 374.8466 421.1852 432.9488 452.8727 466.5281 472.6455 500.0065 510.9095 534.1396 548.0754 578.3880 589.2721 617.3455 639.5884 648.6827 653.8143 667.2689 684.3787 699.9671 713.1951 725.7174 756.2113 778.4283 787.1000 793.1430 812.6144 837.1049 852.5379 909.9261 915.4109 918.2692 921.4083 928.2565 935.7836 958.4342 979.3036 1013.0919 1017.2873 1033.1444 1048.7081 1071.3722 1073.5737 1094.0537 1099.7550 1136.9968 1155.9740 1173.5677 1185.2588 1191.3821 1213.7152 1219.7737 1239.7053 1256.8823 1278.3214 1285.6334 1297.5544 1326.8448 1328.7444 1336.8999 1342.2034 1347.3290 1357.5840 1378.4342 1389.4815 1391.5162 1395.0303 1396.8957 1435.3053 1457.9647 1465.7163 1467.6922 1471.0940 1474.2324 1477.3807 1482.4946 1494.2889 1503.7198 1515.0687 1523.7761 1528.2700 1538.2998 1614.3444 1626.9258 2990.7812 2992.4896 2998.6950 3010.4929 3015.7559 3062.5977 3066.7899 3090.3642 3090.5764 3090.6551 3098.2522 3104.4446 3119.5966 3159.4626 3180.2370 3202.9584 3215.0666 3311.0440
redmass: 7.6383 6.1297 7.8040 3.5845 5.2554 6.7709 2.1791 5.4050 3.3199 5.9781 2.1115 2.9530 5.4080 4.6278 4.9064 6.6445 6.4777 5.4316 4.3623 1.4056 1.1321 4.5134 4.8075 7.8095 4.0820 3.6298 7.3503 3.9275 10.3285 7.1050 6.1722 4.8534 4.4948 5.0686 8.3403 4.8512 4.8525 4.1015 3.1818 5.1055 3.4193 5.5052 3.3752 7.3763 6.5747 7.5768 3.9793 10.0523 5.6183 8.7192 9.4457 9.3146 3.9027 2.6012 1.2815 1.5347 1.6866 8.2491 2.5031 1.4231 1.5626 1.2399 3.2246 2.5032 5.2552 2.3790 1.3234 2.3044 1.9079 4.5626 1.6361 2.2740 1.8862 1.8060 3.7936 2.4574 1.7959 2.1702 2.1305 4.9103 3.3797 4.4540 2.1362 1.6258 1.2441 4.4191 1.5919 12.0356 4.1746 1.2592 2.7320 2.1904 3.1333 3.7533 1.6318 1.4406 1.4922 1.2598 7.6022 1.2920 1.1183 1.0588 1.4604 1.2679 1.0695 1.0864 1.1832 2.0876 2.0510 5.6424 2.8535 2.9559 4.2463 6.6538 1.0356 1.0359 1.0370 1.0619 1.0613 1.1017 1.1016 1.1002 1.0962 1.0996 1.1018 1.1012 1.1022 1.0869 1.0966 1.0917 1.0959 1.0797
irintensity: 0.0204 0.0127 0.1153 0.0212 1.0760 1.7937 5.1907 0.2296 1.3485 1.4917 1.8052 2.1629 3.2026 2.0313 4.3996 3.4719 5.9124 2.3654 0.8706 1.6178 0.5658 4.4896 1.0125 1.6893 2.7797 1.2027 1.8022 0.5187 0.1156 2.0065 0.3480 1.8873 5.4121 9.5308 6.1160 4.8808 13.3821 14.2764 17.4881 3.8150 1.7717 0.3312 0.0872 0.7002 49.9918 0.4153 2.5834 16.3243 5.4757 3.7534 4.3956 7.3897 0.4367 43.6813 3.2887 2.2189 34.3852 1.6838 1.0848 23.6789 44.5062 32.5481 25.3194 15.7922 13.4760 3.7529 3.3833 63.7905 23.7775 22.8592 19.1227 16.9938 105.6045 19.0771 85.9812 39.3195 31.5869 187.9041 461.3022 179.9563 358.2153 1249.1387 92.6034 123.9538 67.6897 71.9351 232.7562 162.0623 1072.7110 11.0295 158.6354 84.6107 80.0451 101.0824 147.3892 114.0397 110.1733 80.1366 166.0329 140.3069 18.2722 34.0931 96.8415 56.1631 23.6750 12.4957 29.4042 83.0445 45.6010 6.1951 269.1975 264.3807 34.5594 773.8265 31.4562 34.1185 5.6623 37.2264 83.3952 1.2063 0.8070 22.5747 8.3335 49.2355 37.0486 48.9139 2.7594 2.2128 15.6562 10.2421 20.1445 91.0936
temp: 298.150 k
press: 1.00000 atm
elementType: 16 8 8 8 8 8 7 7 7 7 7 7 6 6 6 6 6 6 6 6 6 6 6 6 6 6 6 6 1 1 1 1 1 1 1 1 1 1 1 1 1 1 1 1 1 1
symmnumber: 1
zpe: 886107.0 jmol-1
zpe.correction: 0.337500 hartree
zpe.thermalcorrener: 0.365444 hartree
zpe.thermalcorrenthalpy: 0.366389 hartree
zpe.thermalcorrgfe: 0.276242 hartree
zpe.sumelectzpe: -1720.937209 hartree
zpe.sumelectthermal: -1720.909265 hartree
zpe.sumelectthermalent: -1720.908320 hartree
zpe.sumelectthermalfe: -1720.998467 hartree
dipole: -14.0621 -3.4225 -0.1624
dipole: 14.4735
quadrupole: -181.4728 -173.1311 -171.2791
quadrupole: 32.5808 -2.1160 -1.9519
quadrupole: -6.1785 2.1632 4.0152 32.5808 -2.1160 -1.9519
hfenergy: -1721.2747089 hartree
pointgroup: C01 [X(C16H18N6O5S1)]
dipole: -5.6235421 0.6772311 -0.585271 debye
polarizability: 819.7160515|15.0860476|238.1012139|-23.563881|-99.0003243|213.5460813 unknown
InChI: InChI=1S/C16H18N6O5S/c1-4-20(5-2)11-6-7-12(13(8-11)17-10(3)23)18-19-16-14(21(24)25)9-15(28-16)22(26)27/h6-9,17H,4-5H2,1-3H3
charge 0 multiplicity 1
46 atoms
S  3.722402 1.820856 -1.502373
O  -2.881085 -2.599635 2.240149
O  3.769153 -2.368004 1.155582
O  1.963747 -1.142951 1.808479
O  7.489152 0.608069 -0.932514
O  6.559783 2.324703 -2.154661
N  -5.088233 0.573787 -0.687276
N  -1.067109 -1.446797 1.299625
N  0.473832 0.118084 -0.14034
N  1.321101 0.980804 -0.722521
N  3.019494 -1.312089 1.07458
N  6.478245 1.295708 -1.362963
C  -3.715139 0.502174 -0.550969
C  -5.756879 1.642313 -1.471177
C  -5.990595 -0.418389 -0.046275
C  -3.123309 -0.475621 0.313166
C  -2.851564 1.41692 -1.27892
C  -1.729509 -0.557949 0.443764
C  -5.912556 1.288372 -2.967359
C  -6.376671 -0.041276 1.401346
C  -0.866927 0.345397 -0.311428
C  -1.474424 1.337919 -1.150848
C  -1.629437 -2.413065 2.144307
C  2.648989 0.700519 -0.5354
C  3.455304 -0.268593 0.153448
C  -0.615253 -3.23222 2.928096
C  4.855395 -0.160854 -0.10462
C  5.164036 0.898761 -0.940782
H  -5.205614 2.590518 -1.349083
H  -6.753152 1.803178 -1.020788
H  -5.515119 -1.413649 -0.072259
H  -6.899534 -0.484938 -0.67188
H  -3.722194 -1.15736 0.915511
H  -3.280764 2.159673 -1.955453
H  -6.443277 2.099988 -3.49696
H  -6.494737 0.358559 -3.095932
H  -4.930357 1.142947 -3.449225
H  -7.064934 -0.799564 1.815366
H  -6.88443 0.939442 1.4367
H  -5.488202 0.004916 2.053143
H  -0.813246 2.010121 -1.705742
H  -0.03687 -1.331811 1.294617
H  0.399268 -2.802086 2.907096
H  -0.960423 -3.325916 3.970775
H  -0.572608 -4.253126 2.506079
H  5.600852 -0.83194 0.323917
