program: Gaussian 09
title: 000095213
version: EM64L-G09RevD.01
frameworkgroup: C1[X(C11H15NO2)]
method: RPBEPBE
basis: SDD
operation: Freq
keyword: #p
keyword: freq=noraman
keyword: PBEPBE/SDD
title: #p freq=noraman PBEPBE/SDD
converged: YES YES NO NO
title: Mulliken charges:
elementType: O O N C C C C C C C C C C C H H H H H H H H H H H H H H H
charge: -0.285081 -0.265783 -0.438036 0.024683 0.378438 -0.690563 -0.693364 0.483333 -0.351496 -0.375386 -0.364517 -0.428074 0.207831 -0.801096 0.196763 0.211856 0.246281 0.227312 0.203795 0.234724 0.224311 0.238181 0.249527 0.306255 0.217055 0.305369 0.235160 0.267838 0.234685
chargesum: 0.00000
title: Mulliken charges with hydrogens summed into heavy atoms:
elementType: O O N C C C C C C C C C C C
charge: -0.285081 -0.265783 -0.132667 0.221446 0.378438 -0.005114 -0.030534 0.483333 -0.113315 -0.125859 -0.058262 -0.211019 0.207831 -0.063413
polarizability: 2.19108410e+02 -1.10644655e+00 1.29484446e+02 1.87559719e+00 6.10094981e+00 7.75124484e+01
1716.lowfreq: -83.0049 -11.6853 -4.1665 -3.5008 -0.0006 0.0002 0.0005 40.8027 51.1907
frequency: -82.9935 40.7868 51.1042 79.5407 94.5076 99.5253 172.0804 178.1698 182.8036 227.8133 246.5470 309.4920 342.6789 355.9751 380.3685 414.1707 429.9933 460.5078 522.1470 534.1618 580.7848 623.0621 630.7300 631.2819 720.0253 741.8861 815.2306 819.7145 836.1023 852.4610 921.8207 924.7311 932.1685 938.6875 939.5783 974.3200 984.3478 1000.7978 1028.2323 1104.8285 1123.0920 1149.9418 1175.5683 1185.4966 1212.8001 1221.7858 1261.6298 1307.5639 1320.0302 1341.8012 1369.1752 1374.4310 1379.3493 1395.7640 1417.9443 1449.5552 1454.9948 1466.9699 1468.6411 1468.8820 1487.4727 1496.7787 1506.3819 1592.3504 1626.1886 1629.8524 2972.6044 2986.0888 2987.8314 2993.6935 3070.9986 3083.6767 3093.1963 3095.4365 3102.3329 3111.6602 3135.4032 3158.6418 3166.8887 3192.6109 3522.7515
redmass: 1.0584 3.4988 4.0877 3.7953 3.9410 3.4517 1.4878 1.6596 4.2307 1.2026 3.8223 4.2189 3.1043 4.0399 4.3084 3.0931 2.9176 2.9552 2.4966 4.0592 3.0828 5.8951 1.1762 5.6140 3.7854 4.1616 1.3741 3.7386 1.5812 3.4931 3.0599 1.3717 4.9695 1.3596 1.3348 1.3103 1.7891 2.2702 1.6496 1.7067 1.3374 2.0764 1.3828 1.7883 2.4625 3.5275 1.9405 1.4922 1.2876 1.3975 3.6975 1.3478 1.2497 1.2326 3.8507 1.1409 1.0503 1.0516 1.0471 1.0486 1.0653 2.2762 2.2955 5.7336 6.0636 5.2864 1.0846 1.0383 1.0358 1.0360 1.0984 1.0992 1.0997 1.1000 1.1003 1.0898 1.0978 1.0894 1.0944 1.0950 1.0764
irintensity: 0.0014 4.1383 8.5130 1.8094 2.7667 2.2164 0.5640 1.5409 0.4077 0.5778 1.0718 2.4730 0.7263 0.2385 4.4396 0.4857 3.0264 3.1723 27.6001 20.8478 0.0696 3.9916 64.7381 1.1560 0.0800 5.6400 18.8646 5.1602 83.6496 20.8218 47.8223 14.3161 4.9434 0.4311 0.1572 5.0916 20.0969 16.9936 7.7666 79.7534 37.7401 12.2087 22.6304 105.2998 196.6637 134.9232 2.6232 26.2161 18.3776 11.1376 54.0661 65.2632 26.7768 26.7096 41.2684 46.5204 5.0814 4.6560 19.6692 6.0653 17.7347 100.6440 502.9725 17.6201 88.4457 82.8789 28.5501 12.0924 16.4717 27.6781 17.1505 12.9787 40.4302 29.5915 37.1995 22.6103 7.6002 14.8520 6.0326 7.2508 11.5334
temp: 298.150 k
press: 1.00000 atm
elementType: 8 8 7 6 6 6 6 6 6 6 6 6 6 6 1 1 1 1 1 1 1 1 1 1 1 1 1 1 1
symmnumber: 1
zpe: 626133.9 jmol-1
zpe.correction: 0.238482 hartree
zpe.thermalcorrener: 0.252506 hartree
zpe.thermalcorrenthalpy: 0.253450 hartree
zpe.thermalcorrgfe: 0.197105 hartree
zpe.sumelectzpe: -632.326228 hartree
zpe.sumelectthermal: -632.312204 hartree
zpe.sumelectthermalent: -632.311259 hartree
zpe.sumelectthermalfe: -632.367604 hartree
dipole: -0.2677 2.2485 0.5419
dipole: 2.3283
quadrupole: -66.3158 -83.1233 -86.6490
quadrupole: 19.2695 3.0202 0.8870
quadrupole: 12.3802 -4.4273 -7.9530 19.2695 3.0202 0.8870
hfenergy: -632.5647098 hartree
pointgroup: C01 [X(C11H15N1O2)]
dipole: 0.118034 -0.8549736 0.3068912 debye
polarizability: 218.7185433|-1.8248592|127.4580134|-7.563149|-11.7006489|79.928748 unknown
InChI: InChI=1S/C11H15NO2/c1-8(2)14-11-6-4-10(5-7-11)12-9(3)13/h4-8,12H,1-3H3
charge 0 multiplicity 1
29 atoms
O  2.814181 -0.718242 -0.277145
O  -3.461087 1.630944 -0.475639
N  -2.841655 -0.561348 0.095044
C  3.662479 0.46322 -0.603869
C  1.420486 -0.563209 -0.197599
C  3.808571 1.372199 0.629638
C  4.995779 -0.128336 -1.072361
C  -1.419245 -0.511638 -0.017059
C  0.703443 0.62627 -0.479462
C  0.706665 -1.729077 0.179207
C  -0.705894 0.65458 -0.392435
C  -0.694059 -1.701819 0.267383
C  -3.773057 0.453717 -0.124904
C  -5.223499 0.016661 0.096446
H  3.186975 1.015125 -1.441332
H  4.433633 2.250762 0.38504
H  2.831024 1.73449 0.990757
H  4.294857 0.81613 1.450412
H  5.695546 0.67887 -1.354732
H  4.84368 -0.785658 -1.945125
H  5.454531 -0.724709 -0.264261
H  1.221459 1.544237 -0.771816
H  1.269134 -2.642745 0.392901
H  -1.259127 1.569835 -0.609923
H  -1.229765 -2.614846 0.559161
H  -3.223204 -1.468231 0.375065
H  -5.506449 -0.803874 -0.58903
H  -5.879435 0.877702 -0.095089
H  -5.386766 -0.329712 1.134027
