program: Gaussian 09
title: 000095133
version: EM64L-G09RevD.01
frameworkgroup: C1[X(C6H13NO6)]
method: RPBEPBE
basis: SDD
operation: Freq
keyword: #p
keyword: freq=noraman
keyword: PBEPBE/SDD
title: #p freq=noraman PBEPBE/SDD
converged: YES YES NO NO
title: Mulliken charges:
elementType: O O O O O O N C C C C C C H H H H H H H H H H H H H
charge: -0.492837 -0.484868 -0.482077 -0.469924 -0.430946 -0.415154 -0.055606 -0.132397 -0.064353 -0.145221 -0.166475 -0.367941 -0.220646 0.283829 0.266405 0.245835 0.234560 0.257120 0.184562 0.374369 0.369638 0.304891 0.347976 0.352601 0.339600 0.367061
chargesum: 0.00000
title: Mulliken charges with hydrogens summed into heavy atoms:
elementType: O O O O O O N C C C C C C
charge: -0.118468 -0.115231 -0.134101 -0.117323 -0.091346 -0.048093 -0.055606 0.151432 0.202052 0.100614 0.068085 0.073740 0.084245
polarizability: 1.31521281e+02 9.88835934e+00 8.80434772e+01 -6.48995381e+00 3.71409857e+00 7.37102080e+01
1716.lowfreq: -14.6615 -7.0735 -0.0006 0.0005 0.0007 5.6522 38.4837 50.9249 74.8863
frequency: 38.3406 50.8305 74.8597 83.1049 115.0554 129.0457 166.1847 195.1894 206.7894 213.8214 251.3637 255.8375 273.7273 291.4629 312.7856 317.2406 333.7305 387.6023 429.2398 435.9656 449.3242 465.1299 492.6172 534.5471 571.6649 635.0759 695.9628 834.4732 870.8547 892.3503 926.5146 930.4912 949.0006 960.1484 979.4988 1022.3500 1043.6071 1056.7077 1082.7125 1113.1563 1144.1019 1179.3559 1188.8721 1201.0982 1230.1671 1245.7843 1284.0944 1292.1848 1306.7377 1321.8256 1339.4236 1343.2770 1359.1796 1365.4385 1378.7481 1386.2428 1408.4654 1462.2876 1591.2917 2953.8503 2980.1802 2993.7963 3015.2616 3037.2356 3096.3179 3128.4435 3518.6435 3553.2823 3559.6627 3562.0002 3562.8597 3582.0066
redmass: 6.5132 5.7783 4.9749 4.4265 5.4722 4.2087 4.3053 3.1946 2.2491 1.5815 4.4396 2.6515 1.2905 4.9154 1.4114 5.5238 3.0287 6.9196 1.7984 1.8318 2.2733 1.4370 1.2481 3.3718 3.5150 3.2636 4.4025 5.1576 4.2173 5.5895 1.9508 1.7473 4.5271 4.2687 5.0010 2.6719 2.6118 2.1165 1.8476 2.6414 1.3046 1.3422 1.2227 1.1440 1.1836 1.1447 1.2340 1.1420 1.1931 1.2598 1.2234 1.2213 1.5646 1.4597 1.3103 1.5507 1.9986 1.0763 6.3264 1.0696 1.0843 1.0832 1.0846 1.0855 1.0951 1.0921 1.0649 1.0652 1.0675 1.0665 1.0665 1.0667
irintensity: 0.9102 1.2290 2.7067 3.6271 4.8580 0.1563 4.7864 64.2889 26.5702 47.3739 13.2671 54.5321 147.3000 41.4922 61.0726 0.7852 94.9684 2.4006 114.8120 42.4072 61.9217 117.7560 156.4224 80.8216 39.7277 13.9650 59.9009 57.8434 11.0380 150.1935 22.3797 8.9665 93.7505 44.9755 46.4800 89.8470 60.0345 68.5331 7.0584 17.2559 11.3047 20.5428 16.5298 66.0987 55.1394 41.7722 23.9539 12.8807 22.7118 4.7422 5.7547 8.8359 30.4355 58.4864 4.2959 9.9629 20.4813 9.1539 5.0903 89.4069 28.3984 6.4284 33.0268 24.1464 8.8872 3.6352 30.8030 27.7250 49.0670 5.9574 6.5439 5.2864
temp: 298.150 k
press: 1.00000 atm
elementType: 8 8 8 8 8 8 7 6 6 6 6 6 6 1 1 1 1 1 1 1 1 1 1 1 1 1
symmnumber: 1
zpe: 530187.8 jmol-1
zpe.correction: 0.201938 hartree
zpe.thermalcorrener: 0.217732 hartree
zpe.thermalcorrenthalpy: 0.218676 hartree
zpe.thermalcorrgfe: 0.159089 hartree
zpe.sumelectzpe: -741.356322 hartree
zpe.sumelectthermal: -741.340528 hartree
zpe.sumelectthermalent: -741.339584 hartree
zpe.sumelectthermalfe: -741.399171 hartree
dipole: -2.4418 3.8884 2.5436
dipole: 5.2490
quadrupole: -63.1522 -73.8325 -78.7954
quadrupole: 0.8112 -0.3948 6.2095
quadrupole: 8.7745 -1.9058 -6.8687 0.8112 -0.3948 6.2095
hfenergy: -741.5582603 hartree
pointgroup: C01[X(C6H13N1O6)]
dipole: -1.151408 -1.2374078 -1.1864881 debye
dipolederiv: -0.6452623 0.0501118 0.2000511 0.0261441 -0.7255697 -0.1639837 0.2150869 -0.1894602 -0.4740303 -0.5190645 -0.1265844 -0.1733864 -0.092219 -0.7337277 -0.0906031 -0.1598895 -0.0985047 -0.5678265 -0.7772251 0.1986313 -0.0643317 0.1945072 -0.3945063 0.2135406 -0.0915185 0.227283 -0.5783099 -0.5789224 -0.0623439 -0.0944614 -0.1593546 -0.42345 0.1331266 -0.1757306 0.1816923 -0.746705 -0.6651736 0.0568367 0.0561266 0.0584878 -0.7336952 0.2242007 0.126068 0.2324666 -0.2078808 -1.3807676 0.3926896 -0.157183 -0.1621734 -0.0114802 0.034265 -0.2802601 0.1738774 -0.4111542 0.9203284 -0.4233531 0.16551 0.0066851 -0.1472449 0.010795 0.2752659 -0.1119847 -0.1511955 0.3659624 -0.0937282 -0.211213 -0.0818359 0.3462227 0.102717 -0.1273907 0.0879377 0.2783456 0.3022027 0.1326725 0.0984499 0.1231865 0.5254681 0.0481034 -0.0942109 0.153265 0.3083973 0.5408728 -0.1833128 0.10755 -0.0501092 0.2043021 -0.0925879 0.1310006 -0.0630584 0.3100342 0.4774103 -0.0265385 0.0253317 0.0596885 0.2639032 -0.1385 0.0183251 -0.1730958 0.5801737 0.4421137 -0.1243743 0.0227926 -0.1077102 0.4204607 -0.0010399 -0.0069816 -0.0458002 0.1651617 -0.0591987 0.0647366 0.0177287 0.1535292 0.0164737 0.1126945 0.1679277 0.0372891 -0.1247372 0.0624601 -0.0147568 0.0272534 -0.0446259 -0.0373879 0.066587 0.024053 0.0275486 -0.0474356 0.0263612 -0.0379011 0.0253243 -0.0292802 -0.0488398 0.0429018 0.0486014 0.0865155 -0.0513719 0.0090649 0.0468241 0.0313654 0.0973127 -0.0512919 -0.0654882 0.0709771 -0.074057 -0.0895755 0.0818229 -0.0312164 -0.0091322 -0.084662 -0.1221592 0.0211744 -0.033227 -0.0156605 -0.0154567 0.0841915 0.0345188 -0.0045249 0.0658718 0.0814277 -0.0647684 0.03782 -0.0306884 -0.0379643 -0.2198816 -0.0680523 -0.0599456 -0.0810262 -0.0438046 -0.0065503 -0.1300669 -0.0118198 0.0435741 0.201903 0.0705673 -0.0687751 0.0623834 0.4164448 0.0450116 -0.0848024 0.0583009 0.248702 0.26189 0.0926344 0.1271224 0.0614346 0.3084397 -0.024867 0.1270835 -0.0237115 0.3355678 0.0692306 -0.0307368 -0.050082 -0.064148 0.0584016 -0.041131 -0.0536737 -0.0357414 0.1940386 0.206224 -0.0865488 -0.0786638 -0.1555888 0.1338971 -0.1414385 -0.0639501 -0.1167333 0.3306346 0.1522365 0.1103322 0.1285499 0.166928 0.2547792 -0.0627388 0.1445002 -0.0542767 0.2808742 0.3025455 0.0621609 -0.0465073 0.0777219 0.3266601 -0.09728 -0.0567145 -0.1700681 0.0557539 0.3386754 -0.0032688 -0.0149496 -0.0411472 0.1162768 -0.0641406 -0.0282928 -0.0515156 0.3723858 unknown
polarizability: 126.9398897|-17.0155317|91.3966697|6.8916529|4.0734054|74.9384063 unknown
InChI: InChI=1S/C6H13NO6/c8-2-4(10)6(12)5(11)3(9)1-7-13/h1,3-6,8-13H,2H2
charge 0 multiplicity 1
26 atoms
O  -1.800737 1.791364 1.084667
O  0.904513 1.756776 1.105147
O  -3.289385 0.747802 -0.917046
O  0.944974 0.431698 -1.690367
O  -1.447263 -2.134624 0.687181
O  4.613344 -1.074564 0.378734
N  3.215946 -1.279995 -0.014811
C  -1.136766 1.039353 -0.00279
C  0.185397 0.566163 0.629609
C  -2.091546 -0.043946 -0.535018
C  1.096749 -0.195242 -0.348543
C  -2.497464 -1.120729 0.497607
C  2.543133 -0.159802 0.083936
H  -0.900263 1.721412 -0.840708
H  -0.034475 -0.103701 1.484113
H  -1.635441 -0.513973 -1.431746
H  0.757989 -1.248275 -0.392317
H  -2.640138 -0.656275 1.486272
H  -3.452713 -1.596492 0.185289
H  -2.662551 2.120669 0.719579
H  0.222587 2.32906 1.547431
H  2.969398 0.791921 0.427657
H  -3.950118 0.172421 -1.37607
H  1.676533 0.100899 -2.27118
H  -1.397835 -2.710821 -0.116826
H  4.996934 -1.985997 0.296199
