program: Gaussian 09
title: 000093314
version: EM64L-G09RevD.01
frameworkgroup: C1[X(C8H18N2O)]
method: RPBEPBE
basis: SDD
operation: Freq
keyword: #p
keyword: freq=noraman
keyword: PBEPBE/SDD
title: #p freq=noraman PBEPBE/SDD
converged: YES YES NO NO
title: Mulliken charges:
elementType: O N N C C C C C C C C H H H H H H H H H H H H H H H H H H
charge: -0.468803 -0.161990 -0.065612 0.203216 0.202088 -0.354356 -0.678427 -0.680477 -0.697302 -0.689608 -0.710145 0.208740 0.204831 0.228345 0.211178 0.222505 0.224353 0.228390 0.211111 0.226859 0.205908 0.227495 0.228059 0.216331 0.226245 0.243695 0.215001 0.210057 0.362313
chargesum: 0.00000
title: Mulliken charges with hydrogens summed into heavy atoms:
elementType: O N N C C C C C C C C
charge: -0.106490 -0.161990 -0.065612 0.203216 0.202088 0.059216 -0.016399 -0.016622 -0.037040 -0.018973 -0.041393
polarizability: 1.36331606e+02 -4.01331765e+00 9.79329248e+01 4.51370714e+00 -1.36944521e+00 9.39684361e+01
1716.lowfreq: -12.7719 -7.9533 -0.0010 -0.0006 0.0001 8.0669 32.3131 60.0928 92.3419
frequency: 30.5134 60.0106 92.2906 118.3083 134.6969 171.4105 203.1421 207.7435 216.4262 235.9590 245.6989 270.3288 296.7640 336.3850 344.2594 364.7716 382.6356 418.5749 471.4994 525.1654 563.0612 571.0993 616.6575 724.3712 760.0951 800.2585 833.7525 890.7620 917.7377 924.1203 925.8202 950.7903 996.1059 1013.2588 1027.4310 1030.9598 1052.2459 1114.2407 1150.6511 1184.3427 1203.9393 1227.5328 1255.1990 1277.4198 1322.2187 1370.6553 1372.1266 1374.8724 1376.3302 1382.4349 1398.6861 1443.7181 1447.8943 1459.1175 1460.8951 1463.5144 1466.0485 1468.3465 1469.5090 1472.0886 1477.5554 1488.4445 1493.0742 2984.9074 2985.7475 2987.2629 2993.6009 2995.2777 2998.5119 3052.6946 3079.3435 3085.5653 3087.7766 3090.4334 3092.9406 3094.9757 3096.8464 3098.1729 3102.1373 3107.5557 3189.3912
redmass: 2.9143 2.7581 1.9592 3.3579 3.0519 1.0185 1.2563 1.1086 2.4104 1.0619 1.1000 3.0016 2.5886 2.3960 3.0290 3.1315 2.5246 2.4295 2.6536 2.7879 3.6204 4.3949 1.3221 4.6121 1.5987 2.5477 2.4127 3.5662 2.3258 1.6084 1.6606 1.2052 1.3671 1.3911 1.4036 1.4868 3.0183 1.9400 2.9263 2.5058 2.3927 3.0891 2.6637 1.3380 1.5207 1.2006 1.2461 1.2665 1.2141 1.2772 1.2223 1.0847 1.0487 1.0562 1.1202 1.0554 1.4070 1.3310 1.0534 1.0518 1.5708 1.0804 1.0708 1.0344 1.0356 1.0346 1.0357 1.0455 1.0481 1.1012 1.0996 1.1007 1.1003 1.1007 1.0999 1.1003 1.0994 1.0991 1.1006 1.1002 1.0622
irintensity: 0.5432 0.6307 0.5887 1.3354 0.6627 0.0358 0.5431 0.2458 3.3416 0.2967 0.3031 2.3535 1.6443 0.3681 2.5025 4.1992 2.1728 8.8362 12.0693 2.4256 21.1353 14.1263 45.4086 0.3119 3.7536 4.4318 1.7978 30.7262 2.8023 3.4316 2.5483 0.0115 21.5502 1.3354 1.5659 0.1894 26.1797 20.2192 21.8577 62.5764 39.2716 23.0662 3.1480 0.1688 9.7490 18.9002 59.6390 54.4941 32.3345 62.5262 12.9372 2.6179 0.0798 0.8976 8.1312 0.9003 1.0411 19.3442 10.1757 11.8051 7.4993 20.3785 12.4164 17.0298 38.6848 20.8979 21.2957 5.8427 40.6365 5.6601 54.4768 9.2193 1.4778 0.4133 45.7822 19.8345 68.2827 32.6906 33.7293 21.2725 128.8813
temp: 298.150 k
press: 1.00000 atm
elementType: 8 7 7 6 6 6 6 6 6 6 6 1 1 1 1 1 1 1 1 1 1 1 1 1 1 1 1 1 1
symmnumber: 1
zpe: 660752.0 jmol-1
zpe.correction: 0.251667 hartree
zpe.thermalcorrener: 0.266112 hartree
zpe.thermalcorrenthalpy: 0.267057 hartree
zpe.thermalcorrgfe: 0.211191 hartree
zpe.sumelectzpe: -499.421784 hartree
zpe.sumelectthermal: -499.407339 hartree
zpe.sumelectthermalent: -499.406394 hartree
zpe.sumelectthermalfe: -499.462260 hartree
dipole: -2.2374 0.3004 1.2477
dipole: 2.5793
quadrupole: -64.9542 -68.4827 -73.4968
quadrupole: 0.2591 4.9756 -0.9853
quadrupole: 4.0237 0.4952 -4.5189 0.2591 4.9756 -0.9853
hfenergy: -499.6734511 hartree
pointgroup: C01 [X(C8H18N2O1)]
dipole: -0.883701 -0.1317592 -0.4811423 debye
polarizability: 134.762003|8.4230844|99.6098394|-4.7853235|-1.3075252|93.8611245 unknown
InChI: InChI=1S/C8H18N2O/c1-6-8(5,11)10-9-7(2,3)4/h11H,6H2,1-5H3
charge 0 multiplicity 1
29 atoms
O  1.644244 0.381905 1.486854
N  -0.601464 0.01481 0.404648
N  0.208873 0.393517 -0.514128
C  -2.029117 -0.262545 -0.013043
C  1.604006 0.643135 0.060811
C  2.576146 -0.305347 -0.693199
C  -2.283177 -1.737979 0.391487
C  -2.890571 0.686945 0.860163
C  -2.292471 -0.037912 -1.515761
C  1.918005 2.127336 -0.211039
C  2.324015 -1.800289 -0.419976
H  3.596786 -0.032173 -0.364567
H  2.504809 -0.087185 -1.775734
H  -2.036251 -1.899798 1.455335
H  -3.347331 -1.989498 0.234309
H  -1.668337 -2.424673 -0.217413
H  -2.702188 1.743152 0.597897
H  -2.663058 0.547626 1.931507
H  -3.961832 0.472458 0.696725
H  -1.653552 -0.68994 -2.135815
H  -3.351197 -0.262095 -1.739011
H  -2.082025 1.005236 -1.808028
H  2.92474 2.35162 0.179935
H  1.889431 2.346725 -1.292372
H  1.191192 2.774272 0.309257
H  2.359091 -2.000389 0.664728
H  3.095999 -2.418968 -0.911712
H  1.338703 -2.12425 -0.802212
H  0.698532 0.097204 1.713855
