program: Gaussian 09
title: 000093951
version: EM64L-G09RevD.01
frameworkgroup: C1[X(C14H13N4O3)]
method: RPBEPBE
basis: SDD
operation: Freq
keyword: #p
keyword: freq=noraman
keyword: PBEPBE/SDD
title: #p freq=noraman PBEPBE/SDD
converged: YES YES NO NO
title: Mulliken charges:
elementType: O O O N N N N C C C C C C C C C C C C C C H H H H H H H H H H H H H
charge: -0.222116 -0.405111 -0.280023 -0.433601 -0.230456 0.035371 0.010349 0.327104 0.106961 0.440445 -0.308346 -0.337346 0.083509 -0.271550 -0.397339 -0.317889 0.340394 -0.304040 -0.330105 0.198238 -0.531347 0.392117 0.290323 0.304150 0.293122 0.263466 0.280767 0.273054 0.284145 0.259351 0.275864 0.243658 0.242956 0.423926
chargesum: 1.00000
title: Mulliken charges with hydrogens summed into heavy atoms:
elementType: O O O N N N N C C C C C C C C C C C C C C
charge: -0.222116 0.018816 -0.280023 -0.041484 0.028895 0.035371 0.010349 0.327104 0.106961 0.440445 -0.018023 -0.033196 0.083509 0.021571 -0.133873 -0.037122 0.340394 -0.030986 -0.045960 0.198238 0.231130
polarizability: 5.81631367e+02 4.46632218e+01 1.86994521e+02 6.91632818e+00 -5.60899243e+00 8.50009970e+01
1716.lowfreq: -7.6631 -5.2410 -1.6342 -0.0009 -0.0006 0.0010 3.3726 15.1434 31.7484
frequency: -7.2267 15.0694 31.6275 43.3294 56.0207 84.4358 85.8640 96.8402 106.1462 118.2313 146.7184 153.3220 169.9979 185.4584 198.5569 218.0530 255.8575 294.3702 317.0326 376.9084 395.3219 399.5727 414.3776 429.3094 443.8375 488.3477 514.8040 521.7042 545.7119 589.1880 617.8910 623.0170 642.4528 702.0960 714.1630 723.6738 740.9898 755.6109 798.2151 810.5101 831.4234 846.9727 865.1489 893.4860 910.8837 953.6794 959.4154 966.7559 972.1090 989.3214 1008.6019 1009.3406 1020.5905 1099.3224 1106.3776 1123.5192 1131.7334 1158.0722 1172.0402 1186.4649 1236.0623 1253.8714 1274.7564 1310.8075 1327.8104 1341.0144 1374.3619 1388.1134 1428.3756 1434.7298 1451.6553 1460.7294 1470.6770 1471.2182 1497.5920 1521.4768 1539.0112 1547.5277 1561.5627 1607.3044 1630.9836 1656.4549 2191.0789 2990.6911 3031.3788 3093.4994 3143.1997 3158.3833 3162.7598 3166.1591 3173.4387 3181.7508 3186.2797 3195.2415 3295.9190 3524.9085
redmass: 11.2497 9.0833 4.5876 5.5213 5.3812 10.4277 8.0351 7.4320 7.9499 7.0509 5.0548 4.4486 3.0756 1.9051 2.7794 3.6304 6.2417 4.7428 5.6470 4.0420 6.9661 5.6726 3.2101 4.5483 4.8117 6.2540 4.9460 2.7251 2.6831 4.7937 6.3127 1.2313 5.9608 5.8434 4.1152 5.5606 3.9537 4.4946 2.7030 1.6890 1.6034 1.5961 4.8427 3.9734 1.2927 1.3408 6.1947 1.4421 1.3758 2.7042 1.3266 1.2791 3.7470 1.7765 1.2556 1.5679 1.4585 1.2976 1.2050 1.2185 1.8991 1.8767 3.6280 1.3633 1.9007 1.8018 4.0879 2.9834 4.1159 1.2543 3.1131 1.3562 1.8379 1.4089 2.6210 3.8402 6.3433 6.6874 5.2904 5.5949 5.4598 2.0810 13.9988 1.0319 1.0840 1.1057 1.0912 1.1018 1.0931 1.0892 1.0897 1.0950 1.0981 1.0976 1.0761 1.0649
irintensity: 0.0935 0.0321 1.0566 0.2842 0.1108 1.4571 0.9715 2.8696 5.6800 3.0875 2.0756 0.2770 4.8073 0.7092 2.2020 2.2366 0.8958 5.2632 3.0551 7.5779 6.2589 6.7062 12.1793 11.7088 8.6873 33.5141 87.0439 22.7822 17.8593 21.9083 18.8835 165.6895 14.0172 30.8854 3.3392 5.5711 17.5784 11.0459 15.6592 6.6066 119.2529 20.7227 4.3665 7.7568 8.8746 2.8343 85.8489 40.5617 14.7638 0.8870 202.7216 55.1549 91.7469 151.3273 0.1825 115.0768 43.5026 46.3571 120.6342 234.3826 1.6589 1.7596 445.4934 4.6472 161.8995 128.1686 59.3478 16.6655 21.9065 40.4994 142.5546 1.1997 30.1918 27.7546 29.2852 20.2502 70.5156 1.0093 1.3638 313.4862 257.1919 86.1820 3.3412 55.8571 438.3981 22.4208 0.9686 9.8209 7.8687 0.5995 3.2297 3.4131 1.3249 0.0259 479.6336 141.0529
temp: 298.150 k
press: 1.00000 atm
elementType: 8 8 8 7 7 7 7 6 6 6 6 6 6 6 6 6 6 6 6 6 6 1 1 1 1 1 1 1 1 1 1 1 1 1
symmnumber: 1
zpe: 659804.4 jmol-1
zpe.correction: 0.251306 hartree
zpe.thermalcorrener: 0.271005 hartree
zpe.thermalcorrenthalpy: 0.271949 hartree
zpe.thermalcorrgfe: 0.200486 hartree
zpe.sumelectzpe: -984.226390 hartree
zpe.sumelectthermal: -984.206691 hartree
zpe.sumelectthermalent: -984.205747 hartree
zpe.sumelectthermalfe: -984.277210 hartree
dipole: 3.4650 2.6521 -0.5623
dipole: 4.3995
quadrupole: -19.5907 -102.6636 -118.9078
quadrupole: -4.7074 -5.8928 -2.0418
quadrupole: 60.7967 -22.2762 -38.5205 -4.7074 -5.8928 -2.0418
hfenergy: -984.477696 hartree
pointgroup: C01 [X(C14H13N4O3)]
dipole: 1.4352763 -0.8078938 0.5322696 debye
polarizability: 586.2157207|-12.5032189|168.6156568|6.3095604|-34.6584864|98.7955069 unknown
InChI: InChI=1S/C14H13N2O3.N2/c1-19-11-5-3-10(4-6-11)16-13-7-2-9(15)8-12(13)14(17)18;1-2/h2-8,15-17H,1H3;
charge 1 multiplicity 1
34 atoms
O  5.909055 1.057066 -0.55132
O  -2.89588 -2.939861 0.709243
O  -0.596107 -2.877096 0.941259
N  0.629504 -0.623849 0.344786
N  -4.355365 1.769227 -0.429135
N  -6.894364 -0.20851 -0.192912
N  -7.936573 -0.675862 -0.164039
C  -0.580256 -0.0206 0.186977
C  -1.796947 -0.842933 0.321106
C  1.941942 -0.1583 0.108649
C  -0.72929 1.399577 -0.067187
C  -3.040574 -0.272772 0.114171
C  -3.197064 1.154268 -0.20366
C  -1.972919 1.961529 -0.244533
C  2.986528 -0.797787 0.840329
C  2.272327 0.838456 -0.862147
C  4.641679 0.599987 -0.281369
C  4.323323 -0.419893 0.663339
C  3.60435 1.207959 -1.052474
C  -1.687391 -2.289561 0.677675
C  7.063201 0.481262 0.174108
H  0.543989 -1.618831 0.680211
H  0.156913 2.036861 -0.055175
H  -3.935994 -0.898775 0.193066
H  -2.101496 3.03655 -0.402072
H  2.738796 -1.578093 1.569024
H  1.505656 1.267681 -1.511947
H  5.103942 -0.910871 1.2496
H  3.885378 1.947141 -1.807533
H  -5.178658 1.128092 -0.364773
H  7.934558 1.019328 -0.220899
H  7.155345 -0.598607 -0.039175
H  6.966786 0.660042 1.259925
H  -2.785594 -3.897227 0.959982
