program: Gaussian 09
title: 000089245
version: EM64L-G09RevD.01
frameworkgroup: C1[X(C10H18O6)]
method: RPBEPBE
basis: SDD
operation: Freq
keyword: #pfreq=noraman
keyword: PBEPBE/SDD
title: #p freq=noraman PBEPBE/SDD
converged: YES YES NO NO
title: Mulliken charges:
elementType: O O O O O O C C C C C C C C C C H H H H H H H H H H H H H H H H H H
charge: -0.260079 -0.260091 -0.144914 -0.144914 -0.235458 -0.235463 0.022874 0.022879 -0.371686 -0.371707 -0.695448 -0.695470 -0.685062 -0.685064 0.350341 0.350360 0.235255 0.235249 0.218360 0.197203 0.218332 0.197215 0.228341 0.250147 0.217901 0.228343 0.250184 0.217897 0.247446 0.207409 0.217372 0.247463 0.207413 0.217371
chargesum: 0.00000
title: Mulliken charges with hydrogens summed into heavy atoms:
elementType: O O O O O O C C C C C C C C C C
charge: -0.260079 -0.260091 -0.144914 -0.144914 -0.235458 -0.235463 0.258128 0.258128 0.043877 0.043840 0.000941 0.000954 -0.012834 -0.012816 0.350341 0.350360
polarizability: 1.84775810e+02 -5.40235589e-01 1.20923982e+02 3.37412714e-03 1.32712852e-03 1.06447701e+02
1716.lowfreq: -8.1142 -5.9883 -0.0010 -0.0009 0.0005 5.4227 21.2864 22.4401 27.4805
frequency: 19.9834 22.4066 27.3657 53.6478 57.8446 67.9916 94.7540 106.3796 108.1401 139.2748 146.3820 186.5368 201.8768 209.6196 212.3606 227.0347 232.5154 286.9643 296.9283 308.8309 350.4335 377.0099 397.3001 423.8233 462.4841 473.5552 512.9035 642.6934 660.1476 662.7823 677.4211 730.9626 759.7602 798.9246 811.5646 834.2374 844.9715 861.4278 892.8306 930.0695 966.6744 966.7210 992.4675 993.7046 1035.6578 1036.3761 1076.6234 1104.6326 1111.7056 1129.1273 1131.1121 1149.1354 1183.4067 1185.4794 1264.4946 1265.0959 1294.1015 1294.1592 1331.7672 1331.8006 1361.0051 1361.2679 1388.6757 1388.7429 1391.2393 1391.2559 1450.3575 1450.3652 1465.2594 1465.2941 1474.9657 1475.0049 1477.6889 1477.7187 1489.1935 1489.4303 1675.1976 1700.9584 2984.9456 2984.9762 2988.3732 2988.3912 2993.9673 2994.0518 3019.0878 3019.1488 3045.5038 3045.5335 3079.5781 3079.6585 3090.0384 3090.0921 3097.1354 3097.2533 3104.1589 3104.1897
redmass: 3.8837 3.3863 3.6462 6.5936 4.5424 4.6181 10.4659 2.2322 2.2660 2.9940 3.4562 3.5002 1.7240 1.0518 1.1997 1.2240 1.4283 4.9695 7.4033 7.8335 3.7436 3.1650 2.6832 2.8119 3.2948 2.8213 4.1843 9.8438 10.0508 8.2444 11.7588 2.5460 1.9825 1.5529 2.0045 2.8001 3.0705 4.0132 4.2209 8.6663 1.3015 1.2981 1.4034 1.3952 3.0470 3.1177 4.7307 1.7588 2.1287 2.3145 2.2221 6.4723 1.9769 2.0705 1.2217 1.2289 1.3077 1.3087 1.2075 1.2059 1.7206 1.7237 1.2183 1.2185 1.2107 1.2111 1.0757 1.0757 1.0573 1.0572 1.0454 1.0453 1.0452 1.0452 1.0521 1.0521 12.1043 12.0565 1.0384 1.0384 1.0542 1.0541 1.0406 1.0407 1.0877 1.0878 1.0992 1.0992 1.0994 1.0995 1.0984 1.0984 1.1001 1.1001 1.1013 1.1013
irintensity: 1.3638 0.1810 1.7949 0.8011 0.2766 0.7497 0.6618 0.1434 0.2309 0.8180 7.2471 0.9029 4.1179 0.0027 2.5081 0.0726 0.0181 0.2094 0.0115 17.9872 10.7102 3.5345 14.9405 0.3156 5.5006 0.1096 10.9768 1.0968 13.4781 19.6117 11.7872 0.3657 15.9900 10.9592 99.3089 205.9130 17.3806 1.5832 28.7483 8.5517 14.8637 7.6606 124.8180 3.1338 54.5950 0.2841 1324.7355 12.4919 176.5764 15.8409 38.7358 62.5199 6.7431 3.7457 3.9058 1.6131 1.7305 0.2058 4.4777 22.7461 8.4670 0.0398 27.9818 2.8371 6.3441 43.2211 3.6346 3.3638 24.7602 2.8605 5.0962 9.0915 16.4371 18.0727 26.8465 4.0094 319.2085 122.2713 29.5985 31.8232 16.1863 0.9417 55.4893 1.7556 3.9735 6.8199 3.4758 19.6821 57.4126 31.2479 6.7657 31.8890 48.5795 37.8354 23.4799 19.0750
temp: 298.150 k
press: 1.00000 atm
elementType: 8 8 8 8 8 8 6 6 6 6 6 6 6 6 6 6 1 1 1 1 1 1 1 1 1 1 1 1 1 1 1 1 1 1
symmnumber: 1
zpe: 718573.4 jmol-1
zpe.correction: 0.273690 hartree
zpe.thermalcorrener: 0.293416 hartree
zpe.thermalcorrenthalpy: 0.294360 hartree
zpe.thermalcorrgfe: 0.222567 hartree
zpe.sumelectzpe: -841.845933 hartree
zpe.sumelectthermal: -841.826208 hartree
zpe.sumelectthermalent: -841.825263 hartree
zpe.sumelectthermalfe: -841.897056 hartree
dipole: 0.0003 0.0013 -1.8625
dipole: 1.8625
quadrupole: -60.4764 -97.7510 -98.9040
quadrupole: -5.7060 -0.0009 -0.0003
quadrupole: 25.2341 -12.0405 -13.1935 -5.7060 -0.0009 -0.0003
hfenergy: -842.1196233 hartree
pointgroup: C01 [X(C10H18O6)]
dipole: 0.0001189 -0.732774 0.0013689 debye
polarizability: 184.574083|0.0116944|106.447792|3.6237687|0.0365828|121.1256188 unknown
InChI: InChI=1S/C10H18O6/c1-5-7(3)13-9(11)15-16-10(12)14-8(4)6-2/h7-8H,5-6H2,1-4H3
charge 0 multiplicity 1
34 atoms
O  2.730676 1.016076 0.074704
O  -2.730627 1.015456 -0.078832
O  0.715445 1.863981 -0.23442
O  -0.715497 1.864816 0.227009
O  0.967367 0.058276 1.319763
O  -0.96709 0.052712 -1.31975
C  3.760608 0.070394 0.686174
C  -3.76036 0.067056 -0.686435
C  4.881572 -0.017385 -0.356234
C  -4.881929 -0.015783 0.355734
C  4.18774 0.640293 2.042229
C  -4.186616 0.630732 -2.045349
C  4.434935 -0.656473 -1.686924
C  -4.435888 -0.647998 1.689906
C  1.445489 0.857592 0.503674
C  -1.445369 0.855293 -0.506964
H  3.252241 -0.904925 0.812257
H  -3.252041 -0.9089 -0.807745
H  5.279584 1.000176 -0.533059
H  5.702729 -0.609005 0.095366
H  -5.280359 1.002537 0.5272
H  -5.702637 -0.609918 -0.093371
H  4.627044 1.645795 1.921452
H  3.331524 0.702141 2.73498
H  4.948075 -0.019372 2.498843
H  -4.62564 1.63694 -1.929525
H  -3.330018 0.689061 -2.737939
H  -4.946932 -0.030816 -2.499252
H  3.62147 -0.070345 -2.147591
H  4.067151 -1.688226 -1.532393
H  5.274698 -0.70054 -2.403062
H  -3.622572 -0.059508 2.147797
H  -4.068123 -1.68057 1.54094
H  -5.275949 -0.688264 2.405918
