program: Gaussian 09
title: 000088096
version: EM64L-G09RevD.01
frameworkgroup: C1[X(C10H16O5)]
method: RPBEPBE
basis: SDD
operation: Freq
keyword: #pfreq=noraman
keyword: PBEPBE/SDD
title: #p freq=noraman PBEPBE/SDD
converged: YES YES NO NO
title: Mulliken charges:
elementType: O O O O O C C C C C C C C C C H H H H H H H H H H H H H H H H
charge: -0.263693 -0.260479 -0.234835 -0.244707 -0.206179 -0.320629 -0.397059 -0.479736 0.246409 0.259330 -0.065276 -0.262990 -0.262076 -0.662876 -0.663496 0.285593 0.245096 0.240377 0.273057 0.276811 0.171578 0.228248 0.235616 0.237024 0.227258 0.220780 0.249242 0.229290 0.219861 0.230562 0.247901
chargesum: 0.00000
title: Mulliken charges with hydrogens summed into heavy atoms:
elementType: O O O O O C C C C C C C C C C
charge: -0.263693 -0.260479 -0.234835 -0.244707 -0.206179 -0.035036 0.088414 0.070131 0.246409 0.259330 0.106302 0.200873 0.202206 0.036436 0.034828
polarizability: 1.36458414e+02 1.37672220e+00 1.30725799e+02 4.90208045e+00 -2.35509124e+00 1.02024348e+02
1716.lowfreq: -14.5080 -8.7609 -2.8821 -0.0007 0.0001 0.0008 4.7830 20.3416 36.5341
frequency: -4.5087 19.8676 36.4141 51.1745 54.0895 81.0556 99.0948 105.0280 126.9388 142.3148 180.6411 181.3889 202.3332 208.4568 240.4306 262.1478 291.5709 322.2641 340.8455 401.4110 441.1616 484.9369 559.6229 639.6406 662.7067 679.4453 725.5613 740.4053 773.1914 802.2974 816.6623 828.9292 836.1481 854.9827 919.1226 929.9191 1001.8090 1012.6646 1031.8383 1066.7783 1093.8844 1094.6798 1096.1404 1117.5706 1155.9667 1156.9629 1160.2979 1178.2415 1233.1592 1269.3513 1276.4393 1277.6780 1301.3226 1319.6615 1353.6502 1356.7719 1366.1367 1380.6284 1390.5292 1391.7265 1439.3890 1456.8941 1457.1759 1462.0068 1463.6477 1463.8890 1483.9289 1484.4128 1629.7578 1638.4871 1641.3642 2861.9153 2967.6104 2994.0772 2994.4450 3013.0105 3014.8687 3027.8703 3033.0713 3033.3724 3073.6546 3089.4723 3089.8952 3095.4342 3095.5553 3122.0300 3122.2336
redmass: 3.8809 5.6739 4.0805 3.2033 3.8508 3.8870 4.6429 3.3379 3.6491 3.9811 1.9544 4.0227 1.4869 1.4748 2.0039 2.4935 2.7462 3.5209 5.7684 4.2077 3.5156 4.2440 7.1984 3.0527 3.1149 1.5546 3.6250 5.8277 2.0347 1.5236 1.6203 2.7147 2.5120 2.1017 2.6118 2.4838 2.5388 2.7640 2.4883 2.3009 2.7654 2.7173 2.2311 2.6971 1.7490 1.6891 2.5087 1.2672 1.8322 1.2132 1.1232 1.1197 1.5064 1.4726 1.2798 1.3416 1.3821 1.3586 1.2330 1.2328 1.0985 1.0950 1.0946 1.0815 1.0442 1.0432 1.0518 1.0516 8.5403 8.4600 7.9487 1.0847 1.0640 1.0360 1.0361 1.0649 1.0926 1.0790 1.0598 1.0598 1.1025 1.0973 1.0974 1.1030 1.1029 1.1067 1.1066
irintensity: 0.9109 1.8676 2.8077 1.0613 0.2889 1.7853 1.6285 6.0742 3.6452 4.3591 5.1401 5.4847 6.1142 3.7032 1.0719 4.3704 6.1692 11.3954 14.1120 6.6792 3.2734 8.3532 11.4441 1.8207 7.5657 17.0268 6.9339 6.0619 8.9949 8.6643 6.8776 4.4962 1.1001 3.7865 9.6319 4.2444 7.1578 74.0706 38.7630 98.1685 132.4451 60.5960 8.9592 215.6400 14.0327 20.0940 232.6191 27.3520 20.8493 45.7349 6.2503 5.7109 89.7507 62.5213 1.6068 8.6914 6.2668 15.4084 24.4198 20.7401 36.2604 5.3432 10.8571 35.7136 17.2387 15.4986 12.2107 12.8979 98.5163 206.4665 136.6059 149.7179 36.6396 20.6599 14.3117 9.5512 2.7069 6.9422 18.7507 33.1781 13.0634 31.5037 34.4421 1.4019 1.2209 27.3644 31.6078
temp: 298.150 k
press: 1.00000 atm
elementType: 8 8 8 8 8 6 6 6 6 6 6 6 6 6 6 1 1 1 1 1 1 1 1 1 1 1 1 1 1 1 1
symmnumber: 1
zpe: 654211.1 jmol-1
zpe.correction: 0.249176 hartree
zpe.thermalcorrener: 0.266071 hartree
zpe.thermalcorrenthalpy: 0.267015 hartree
zpe.thermalcorrgfe: 0.202199 hartree
zpe.sumelectzpe: -765.590209 hartree
zpe.sumelectthermal: -765.573313 hartree
zpe.sumelectthermalent: -765.572369 hartree
zpe.sumelectthermalfe: -765.637186 hartree
dipole: 2.4543 3.6570 0.5156
dipole: 4.4343
quadrupole: -84.1670 -90.0683 -90.6332
quadrupole: -9.0107 -3.5095 -5.8645
quadrupole: 4.1225 -1.7788 -2.3437 -9.0107 -3.5095 -5.8645
hfenergy: -765.8393844 hartree
pointgroup: C01 [X(C10H16O5)]
dipole: 0.1715892 1.6827554 -0.4271217 debye
polarizability: 133.5700167|5.3493869|129.3513634|5.1302166|-10.0619517|106.2871806 unknown
InChI: InChI=1S/C10H16O5/c1-3-14-9(12)8(6-5-7-11)10(13)15-4-2/h7-8H,3-6H2,1-2H3
charge 0 multiplicity 1
31 atoms
O  1.760864 1.248004 -0.450577
O  -1.651841 0.809614 -1.303082
O  2.443507 -0.813105 0.399384
O  -1.133779 0.764136 0.972731
O  -1.207277 -4.435847 0.923316
C  0.20157 -0.563127 -0.643553
C  -0.121174 -2.018762 -0.203506
C  -0.168982 -2.239259 1.31989
C  1.57899 -0.097119 -0.153758
C  -0.897059 0.407958 -0.205462
C  -0.743203 -3.58149 1.71879
C  3.075436 1.856385 -0.064474
C  -2.821876 1.704491 -1.021632
C  4.119413 1.628383 -1.160361
C  -4.058866 0.876942 -0.663798
H  0.232356 -0.529212 -1.748846
H  0.645346 -2.684303 -0.63929
H  -1.085988 -2.319403 -0.651792
H  -0.768239 -1.453893 1.828463
H  0.84516 -2.15364 1.76039
H  -0.736549 -3.778916 2.82291
H  2.833391 2.922773 0.06609
H  3.393462 1.415891 0.896547
H  -2.543972 2.392986 -0.204666
H  -2.950199 2.259997 -1.963938
H  5.054079 2.157352 -0.89698
H  4.350915 0.555361 -1.266329
H  3.764953 2.017974 -2.130123
H  -4.932171 1.545181 -0.547966
H  -4.287925 0.145673 -1.457889
H  -3.910542 0.338975 0.287407
